program: Gaussian 09
title: 000290884
version: EM64L-G09RevD.01
frameworkgroup: C1[X(C13H7Cl2NO3S)]
method: RPBEPBE
basis: SDD
operation: Freq
keyword: #p
keyword: freq=noraman
keyword: PBEPBE/SDD
title: #p freq=noraman PBEPBE/SDD
converged: YES YES NO NO
title: Mulliken charges:
elementType: Cl Cl S O O O N C C C C C C C C C C C C C H H H H H H H
charge: 0.036957 0.029429 0.412480 -0.169163 -0.190851 -0.186541 -0.193956 0.183381 0.175680 0.129790 0.142832 -0.446356 0.715256 -0.346231 -0.345414 -0.209277 -0.209219 -0.085506 -0.772492 -0.506572 0.250848 0.257539 0.270321 0.270688 0.241152 0.241217 0.304005
chargesum: 0.00000
title: Mulliken charges with hydrogens summed into heavy atoms:
elementType: Cl Cl S O O O N C C C C C C C C C C C C C
charge: 0.036957 0.029429 0.412480 -0.169163 -0.190851 -0.186541 -0.193956 0.183381 0.175680 0.129790 0.142832 0.062032 0.715256 -0.075910 -0.074725 0.031875 0.031998 0.218499 -0.772492 -0.506572
polarizability: 1.91071655e+02 -2.15644868e+01 2.18988049e+02 2.65580237e+01 -4.26503024e-02 1.46132890e+02
1716.lowfreq: -6.6981 -5.6491 -0.0017 -0.0012 -0.0012 2.7997 9.5351 17.3822 35.2452
frequency: 9.4466 17.3644 35.2412 68.5239 81.6904 106.6521 135.2854 140.6593 172.1429 178.2954 220.0177 231.4031 237.1809 282.1209 299.7028 318.1059 331.1235 352.1259 403.0537 417.4335 453.6212 461.9214 477.2548 500.1803 512.5670 559.6289 575.8846 634.8792 656.3762 675.6347 682.4574 688.3942 696.2150 780.3915 790.4119 820.9690 842.0950 853.9008 883.6823 907.9151 926.5358 949.6724 974.7336 989.6516 1007.4402 1014.2244 1034.3524 1059.6551 1086.7745 1164.5851 1168.2977 1180.5978 1192.1286 1216.7821 1271.2285 1284.0886 1331.9962 1356.3050 1414.9833 1452.5421 1453.1187 1458.9613 1483.9319 1563.8678 1611.8785 1618.2361 1642.7162 1684.0285 3030.5139 3100.5672 3141.7382 3154.8295 3166.1582 3176.2060 3197.1381
redmass: 13.7826 9.8563 9.1154 8.1827 11.1531 28.8904 7.6453 5.8137 10.1982 11.0238 3.9424 7.7056 6.5509 10.1415 10.5360 11.1515 18.3340 6.2774 3.1782 8.6171 4.9042 6.7106 7.9132 5.5409 7.2026 5.0416 9.0490 9.6278 4.8448 5.1427 6.7710 5.9922 4.5326 5.3627 1.4785 4.4287 1.6223 7.9312 6.0877 1.3888 9.9420 7.0526 1.4087 2.9143 1.3481 2.0898 3.3082 3.6733 5.0130 1.4449 1.9495 1.3624 2.1017 1.1871 7.1422 1.4924 1.3961 3.8916 6.3342 2.7479 2.4423 1.1016 9.3021 7.4138 7.5520 7.5727 12.6226 12.6986 1.0574 1.1082 1.0865 1.0907 1.0956 1.1004 1.0959
irintensity: 0.2040 0.9616 0.1204 2.7165 3.5281 0.0372 2.0727 0.9418 1.5120 0.0563 1.1010 0.9593 1.9018 0.8376 7.6947 11.9705 1.2993 4.6658 1.0409 3.4630 0.1079 20.1640 14.9318 2.3805 12.9185 2.0553 6.9004 4.2211 0.1691 33.2350 10.3800 20.3732 40.3865 0.0617 38.8025 46.6877 25.0519 14.9762 79.0887 0.1195 130.8080 10.0613 2.0395 30.5192 0.0036 0.7928 6.5287 67.7021 23.6397 21.5023 1.3662 27.4975 14.3555 11.5190 137.6017 0.6235 18.0006 4.2088 9.9315 1.8860 11.4151 21.4233 64.8321 23.3317 2.0763 21.1485 387.9333 48.0690 14.4589 1.4066 1.7001 4.6195 4.4745 19.1355 5.3383
temp: 298.150 k
press: 1.00000 atm
elementType: 17 17 16 8 8 8 7 6 6 6 6 6 6 6 6 6 6 6 6 6 1 1 1 1 1 1 1
symmnumber: 1
zpe: 448913.1 jmol-1
zpe.correction: 0.170982 hartree
zpe.thermalcorrener: 0.188766 hartree
zpe.thermalcorrenthalpy: 0.189710 hartree
zpe.thermalcorrgfe: 0.121438 hartree
zpe.sumelectzpe: -2096.722550 hartree
zpe.sumelectthermal: -2096.704767 hartree
zpe.sumelectthermalent: -2096.703823 hartree
zpe.sumelectthermalfe: -2096.772095 hartree
dipole: -2.2115 -0.6681 -2.3543
dipole: 3.2985
quadrupole: -118.0471 -138.5463 -134.5175
quadrupole: 10.2909 13.4008 4.0173
quadrupole: 12.3232 -8.1760 -4.1472 10.2909 13.4008 4.0173
hfenergy: -2096.8935322 hartree
pointgroup: C01 [X(C13H7Cl2N1O3S1)]
dipole: 1.0492088 -0.3827058 0.6609088 debye
polarizability: 193.2716192|9.7671975|213.7255715|22.5455722|28.8138034|149.1954028 unknown
InChI: InChI=1S/C13H7Cl2NO3S/c14-10-5-7(11(15)20-10)6-19-16-12(17)8-3-1-2-4-9(8)13(16)18/h1-5H,6H2
charge 0 multiplicity 1
27 atoms
Cl -2.157822 1.597757 2.802739
Cl -3.588206 -3.472552 -0.003616
S  -3.125277 -1.266918 2.132396
O  -0.590867 1.281058 -1.466665
O  1.310521 2.718889 0.268561
O  0.373358 -1.474701 -1.728852
N  0.535383 0.72931 -0.803418
C  2.574852 0.561672 0.264597
C  2.291317 -0.692184 -0.336461
C  1.462276 1.516173 -0.044719
C  0.977229 -0.612309 -1.054741
C  -1.70859 1.594296 -0.498548
C  -2.216248 0.378764 0.224937
C  3.746991 0.768662 1.006141
C  3.172539 -1.776012 -0.213949
C  4.646233 -0.32267 1.133267
C  4.363388 -1.575082 0.53279
C  -2.570512 -0.860089 -0.44645
C  -2.443495 0.312553 1.589782
C  -3.060101 -1.819943 0.408102
H  -2.459356 2.007787 -1.193809
H  -1.369595 2.381159 0.195834
H  3.95462 1.740255 1.465049
H  2.943144 -2.738688 -0.681237
H  5.57321 -0.196792 1.70262
H  5.075732 -2.398945 0.647401
H  -2.411425 -1.014851 -1.515548
