program: Gaussian 09
title: 000290852
version: EM64L-G09RevD.01
frameworkgroup: C1[X(C22H21NO6)]
method: RPBEPBE
basis: SDD
operation: Freq
keyword: #p
keyword: freq=noraman
keyword: PBEPBE/SDD
title: #p freq=noraman PBEPBE/SDD
converged: YES YES NO NO
title: Mulliken charges:
elementType: O O O O O O N C C C C C C C C C C C C C C C C C C C C C C H H H H H H H H H H H H H H H H H H H H H
charge: -0.303488 -0.186325 -0.258603 -0.257394 -0.278079 -0.322081 -0.473612 -0.024727 -0.484107 -0.354742 -0.441433 -0.518159 0.176917 0.198305 0.202620 0.355916 0.214148 0.026247 -0.325727 -0.347559 -0.311099 -0.305212 -0.215706 -0.247123 0.226111 -0.221190 -0.232016 -0.221363 -0.497299 0.264754 0.265106 0.230713 0.282548 0.213333 0.234960 0.282210 0.241057 0.382753 0.310329 0.273625 0.268727 0.286026 0.231306 0.234313 0.232353 0.231754 0.231256 0.236314 0.244978 0.248365
chargesum: 0.00000
title: Mulliken charges with hydrogens summed into heavy atoms:
elementType: O O O O O O N C C C C C C C C C C C C C C C C C C C C C C
charge: -0.303488 -0.186325 -0.258603 -0.257394 -0.278079 -0.322081 -0.090859 0.240027 0.011712 -0.072194 0.006861 0.005108 0.176917 0.198305 0.202620 0.355916 0.214148 0.026247 -0.015399 -0.078832 -0.025073 -0.031587 0.015600 -0.012811 0.226111 0.011163 -0.000262 0.009893 0.232357
polarizability: 2.99616863e+02 -4.49908298e+01 2.32400815e+02 -8.63923711e+00 -4.12331055e+01 2.46598030e+02
1716.lowfreq: -10.6862 -2.8983 -0.0005 -0.0002 0.0004 3.7805 7.9140 15.8892 30.1112
frequency: 5.9737 15.6453 29.9669 32.8838 40.5393 61.2685 65.7636 69.5224 92.8240 96.3372 102.3437 109.4400 125.2903 135.4736 158.5012 165.7353 179.8682 202.8173 212.7639 246.9098 261.4083 285.8463 296.6038 317.1806 338.0373 355.0093 385.1519 396.0881 398.9974 403.9438 436.0988 439.3512 465.3858 477.4990 494.8444 501.6318 530.6604 568.9589 606.8548 613.8102 634.5760 655.2439 657.6056 679.1154 682.2092 701.3633 711.0324 737.1688 756.0237 761.5188 779.1252 787.0405 794.4106 798.5157 831.0091 838.7539 864.3555 872.8197 889.7933 903.2959 913.7528 920.4902 927.8694 944.4222 956.4449 981.2715 989.5327 990.1274 996.7445 1007.3541 1009.1423 1018.2433 1041.5609 1046.3290 1047.2840 1058.1876 1062.1651 1087.7603 1100.5721 1114.6907 1121.7279 1131.5572 1151.1028 1171.3437 1173.5468 1176.0374 1179.2059 1186.2087 1214.6212 1230.4801 1239.1315 1243.7917 1255.0183 1271.9100 1290.8717 1302.0228 1309.6577 1318.8444 1330.7410 1341.4284 1355.2917 1366.1519 1382.0781 1389.7315 1423.9610 1438.1205 1440.2750 1445.7192 1452.9602 1454.4202 1458.1554 1463.2130 1465.8733 1478.4876 1514.2112 1571.2340 1582.4166 1583.7010 1611.1864 1615.4549 1618.9785 1638.3875 1649.6494 2993.2593 2995.7556 3007.2669 3008.5747 3011.2133 3038.5764 3057.6459 3063.1122 3089.1904 3112.3387 3128.9883 3137.6225 3141.8082 3153.7488 3154.2253 3159.0451 3166.2543 3177.7747 3182.5878 3195.9411 3222.1355
redmass: 6.2978 5.5242 5.8600 5.2266 6.7852 5.6070 6.0525 6.2780 5.8697 3.3970 1.4264 5.1655 5.0637 3.6173 5.0833 4.0625 4.5461 3.5448 5.0130 6.0253 5.4929 4.5227 7.4309 4.5681 4.5743 3.4367 3.2410 4.3036 5.8735 2.8378 3.6962 3.9141 4.7626 5.4430 3.8282 6.0891 3.4059 7.2059 5.2632 6.4422 5.2011 6.3919 6.6071 5.1004 5.0544 1.6217 4.7449 3.6128 2.6247 2.7405 4.9422 1.6925 2.2584 4.6625 3.1274 4.4005 1.2469 3.1425 3.2384 1.3767 4.5896 1.2086 4.7365 3.0442 1.4215 1.3687 4.4896 2.4334 1.4448 1.3338 1.3224 3.2556 2.4318 1.9560 2.7961 2.4442 4.0684 1.6730 1.4007 1.2597 1.8774 1.8817 1.5393 1.4550 1.0653 1.2358 1.6947 1.1266 1.4296 1.9370 2.2713 1.6302 1.9445 2.2618 1.6486 1.5686 2.0521 1.3126 1.7543 1.4001 1.4566 1.4220 7.0820 9.7892 1.4165 2.2443 2.0081 1.1187 1.0495 1.0895 2.1574 1.1584 1.0892 2.2644 3.1590 5.9785 6.9053 6.6973 6.1929 6.2016 9.1673 5.3182 2.7440 1.0637 1.0650 1.0605 1.0294 1.0807 1.0856 1.1003 1.0995 1.1015 1.1048 1.0855 1.0875 1.0891 1.1050 1.0940 1.0926 1.0981 1.0978 1.0963 1.0953 1.0819
irintensity: 0.2545 0.5652 0.5854 1.2212 2.6534 0.1736 0.5116 1.3120 2.3269 1.8065 0.5058 6.3569 0.4854 0.0729 2.2546 0.9146 6.8195 7.3200 5.4554 4.1378 8.2029 4.3334 0.8706 2.8045 39.0598 2.3589 1.7852 2.6271 4.5365 0.1886 0.9842 1.8411 1.1308 7.1837 2.2475 7.4714 10.2717 2.6177 1.7116 0.5329 2.8098 3.9285 5.1191 15.9810 21.7448 100.2320 1.1527 1.4187 13.5744 19.6605 9.5758 49.9879 15.0065 2.5814 6.1896 1.4341 1.0065 12.6588 21.6296 1.8859 29.7860 104.1337 38.0247 26.2906 9.8563 4.0345 6.7661 6.0417 0.9227 2.8446 1.5203 103.1862 16.9447 22.6471 146.6154 43.0271 99.6716 10.0620 6.2636 0.0763 66.6350 25.3651 91.8832 31.0433 1.1151 28.9153 42.9868 33.8655 5.9399 150.3103 180.7122 146.9917 105.9759 272.8227 8.3446 42.0165 146.7667 0.1232 0.8146 5.6974 7.6201 3.5174 41.0209 2.6417 48.4780 11.2350 50.7714 29.1893 14.9285 16.9122 14.7686 9.0804 22.5824 6.7532 539.9797 19.4961 277.1105 79.7812 20.5103 46.4519 216.3819 139.4098 56.2488 9.1178 33.3291 9.4464 36.5005 13.9180 25.0712 22.1829 21.3006 18.5965 21.7855 0.6264 5.9958 11.3769 16.3878 13.0771 15.0144 18.2720 7.7975 6.4757 8.5456 218.9392
temp: 298.150 k
press: 1.00000 atm
elementType: 8 8 8 8 8 8 7 6 6 6 6 6 6 6 6 6 6 6 6 6 6 6 6 6 6 6 6 6 6 1 1 1 1 1 1 1 1 1 1 1 1 1 1 1 1 1 1 1 1 1
symmnumber: 1
zpe: 1019865.1 jmol-1
zpe.correction: 0.388446 hartree
zpe.thermalcorrener: 0.414741 hartree
zpe.thermalcorrenthalpy: 0.415685 hartree
zpe.thermalcorrgfe: 0.327845 hartree
zpe.sumelectzpe: -1354.994196 hartree
zpe.sumelectthermal: -1354.967901 hartree
zpe.sumelectthermalent: -1354.966957 hartree
zpe.sumelectthermalfe: -1355.054797 hartree
dipole: -4.3655 1.7288 2.0459
dipole: 5.1217
quadrupole: -152.9185 -162.7084 -169.5901
quadrupole: 8.3273 7.6313 -19.1438
quadrupole: 8.8205 -0.9694 -7.8511 8.3273 7.6313 -19.1438
hfenergy: -1355.3826422 hartree
pointgroup: C01 [X(C22H21N1O6)]
dipole: 1.0927164 -1.4286075 0.9085563 debye
polarizability: 240.9871082|-41.1245149|302.9418631|36.2150546|25.0700735|234.6867365 unknown
InChI: InChI=1S/C22H21NO6/c1-28-22(27)16-9-5-6-10-18(16)23-20(25)17-13-15(11-12-19(17)24)29-21(26)14-7-3-2-4-8-14/h2-10,15,17,23H,11-13H2,1H3
charge 0 multiplicity 1
50 atoms
O  -2.186607 0.650605 0.872855
O  -1.836505 4.513503 -2.004535
O  -1.064615 0.981143 -2.177239
O  -1.29369 0.025749 2.938884
O  4.510127 -0.190261 1.022388
O  2.838542 1.40832 0.897651
N  0.898561 1.022287 -0.876259
C  -2.209195 2.081625 1.317494
C  -0.880639 2.756402 0.928263
C  -0.678687 2.873216 -0.618353
C  -3.423237 2.729029 0.637185
C  -3.253023 2.8467 -0.904117
C  -1.929382 3.500269 -1.265301
C  -0.329159 1.525251 -1.300609
C  -1.684699 -0.288666 1.785995
C  1.568572 -0.150328 -1.289098
C  -1.701018 -1.669125 1.224558
C  2.800114 -0.50929 -0.629026
C  1.078484 -0.981373 -2.334753
C  -1.360893 -2.743566 2.088028
C  -2.038654 -1.924576 -0.130615
C  3.494561 -1.681163 -1.03645
C  1.791933 -2.132493 -2.715399
C  3.002041 -2.492032 -2.071717
C  3.34599 0.321964 0.467636
C  -1.370331 -4.066892 1.603003
C  -2.04457 -3.251328 -0.609787
C  -1.714751 -4.323019 0.253628
C  5.096976 0.597535 2.133689
H  -2.312138 2.085296 2.418255
H  -0.036569 2.225234 1.403902
H  -0.889999 3.77957 1.35267
H  0.166854 3.563081 -0.808862
H  -3.561741 3.736738 1.076458
H  -4.330366 2.143341 0.869348
H  -3.245917 1.832434 -1.346268
H  -4.076941 3.425804 -1.353333
H  1.413616 1.540732 -0.136791
H  0.145245 -0.703648 -2.826717
H  4.424035 -1.934976 -0.520586
H  -1.097123 -2.519212 3.126943
H  -2.279043 -1.088068 -0.792805
H  1.398189 -2.756116 -3.525833
H  3.547881 -3.390474 -2.376042
H  -1.11206 -4.896135 2.270435
H  -2.303012 -3.449598 -1.655584
H  -1.722938 -5.352224 -0.12295
H  5.990401 0.031828 2.431648
H  5.361982 1.609487 1.785147
H  4.377304 0.676015 2.965264
