program: Gaussian 09
title: 000290850
version: EM64L-G09RevD.01
frameworkgroup: C1[X(C19H21NO3S)]
method: RPBEPBE
basis: SDD
operation: Freq
keyword: #p
keyword: freq=noraman
keyword: PBEPBE/SDD
title: #p freq=noraman PBEPBE/SDD
converged: YES YES NO NO
title: Mulliken charges:
elementType: S O O O N C C C C C C C C C C C C C C C C C C C H H H H H H H H H H H H H H H H H H H H H
charge: 0.237514 -0.296438 -0.279230 -0.287875 -0.044650 0.053221 -0.295309 -0.536406 0.434963 0.457944 -0.442106 -0.286414 0.427920 -0.363885 -0.391024 -0.318451 -0.260312 -0.211242 -0.274045 -0.355798 -0.240430 -0.213409 -0.677770 -0.678667 0.183401 0.252319 0.212635 0.293058 0.260065 0.239441 0.255919 0.215466 0.221035 0.181300 0.229304 0.245774 0.260296 0.233076 0.234220 0.222550 0.229230 0.213858 0.205220 0.227705 0.226026
chargesum: 0.00000
title: Mulliken charges with hydrogens summed into heavy atoms:
elementType: S O O O N C C C C C C C C C C C C C C C C C C C
charge: 0.237514 -0.296438 -0.279230 -0.287875 -0.044650 0.236622 -0.295309 -0.071452 0.434963 0.457944 -0.149048 -0.286414 0.427920 -0.103820 -0.151583 -0.062532 0.176189 0.199362 -0.028271 -0.095502 -0.007354 0.020811 -0.012132 -0.019715
polarizability: 4.15027976e+02 1.09511737e+01 2.19965980e+02 2.04470215e+00 3.46640108e+01 1.57631953e+02
1716.lowfreq: -8.5234 -2.0425 -0.0015 -0.0004 0.0014 4.4558 15.1537 17.1487 25.4725
frequency: 12.5462 15.0962 25.2711 35.8718 41.7478 48.3368 75.3367 79.1927 108.8043 117.9602 126.7296 155.3173 173.5485 185.2365 207.8042 220.0290 235.4911 240.7586 255.9309 281.9094 306.9077 314.5352 339.9261 376.2376 379.8996 395.3773 412.9276 419.6690 422.9464 440.9319 450.6137 480.7188 520.8257 543.3589 567.6246 592.8084 620.2855 657.3375 668.7862 698.9446 704.4257 721.7619 754.8357 763.3509 784.3508 799.1096 805.8681 822.0141 832.1826 850.9417 853.9607 873.7684 896.1904 917.9931 920.8720 935.2321 947.2242 959.7858 975.1191 996.8236 1021.4526 1033.5720 1035.5616 1041.8478 1045.9211 1049.2966 1073.4139 1102.4753 1117.9667 1119.5018 1131.0975 1137.5079 1161.6408 1167.8394 1179.7394 1201.5745 1226.8037 1236.1738 1245.0152 1254.8561 1264.8314 1277.4115 1298.3021 1318.7268 1345.8689 1359.9665 1366.5168 1376.0246 1378.1391 1385.4612 1394.7347 1400.7810 1404.7569 1427.6710 1439.8111 1454.6431 1459.3341 1467.4744 1473.6430 1476.2262 1479.1711 1489.7131 1492.9389 1571.1313 1580.6770 1596.6106 1606.1064 1625.3284 2875.3613 2941.7903 2974.1283 2982.8351 2985.5562 2992.8936 3025.0411 3025.8969 3038.7256 3060.3312 3079.6036 3090.3943 3092.5238 3100.6506 3136.3847 3136.7510 3147.1029 3150.5370 3162.6152 3170.4714 3176.2447
redmass: 2.5228 4.8006 5.6768 4.0205 3.3609 3.3038 5.1635 4.1368 2.7124 3.3814 4.6917 5.0197 3.7813 3.3027 2.9875 5.9903 1.4714 1.2973 5.6592 2.2776 4.4696 3.3573 5.8761 4.9836 3.0393 5.3768 3.3945 4.2167 8.3505 3.1663 4.1200 6.2311 4.1792 3.8648 4.3115 6.7412 5.9246 6.8176 7.0322 4.5456 4.3067 3.8611 1.4234 3.3268 2.7709 1.2662 1.1243 1.5982 2.3630 4.8923 1.4259 2.7903 3.3639 1.4763 3.7867 1.3720 1.5739 1.7917 1.3121 2.2572 4.0813 3.7875 2.4091 2.8912 3.7393 3.0349 2.3067 2.7367 2.0071 1.6484 1.4009 1.4647 1.7611 1.0803 2.1200 2.1287 1.4025 2.8939 1.1560 1.4870 1.4208 1.0983 1.3194 1.1727 1.3540 2.7648 1.2709 1.3655 6.7304 1.2244 1.3254 5.4548 1.6809 2.2612 1.1099 2.5375 1.0412 1.0465 3.0757 1.0549 1.0476 1.0766 1.0822 7.7468 6.4502 7.4429 6.7919 6.6867 1.0820 1.0654 1.0654 1.0374 1.0602 1.0359 1.0920 1.0973 1.0967 1.0978 1.0975 1.0989 1.1017 1.1012 1.0860 1.0894 1.0903 1.0918 1.0946 1.0955 1.1003
irintensity: 0.4139 0.1357 1.1293 0.5795 0.7477 1.0786 0.9608 1.6387 4.9711 4.2061 3.7912 8.0504 6.7422 2.3503 0.6325 0.3376 1.9191 1.1262 1.0426 2.2875 8.8195 7.9435 4.6660 2.2835 3.7035 1.0144 4.1705 0.7159 1.3128 0.0679 9.8640 4.2665 0.0836 5.9557 6.2379 10.8470 5.8371 24.6981 3.1688 5.9622 20.8359 2.2309 70.0240 45.5679 14.7172 3.4164 7.5132 29.8735 57.5096 9.5724 1.4596 16.1314 31.7428 22.0919 30.5453 3.0489 2.5447 2.9086 0.1242 9.9557 4.1984 51.8915 15.3830 52.6625 16.2456 171.2882 88.5485 22.9723 23.0399 7.8484 16.6180 5.9597 17.1325 1.0232 11.3384 58.3948 131.8794 419.9334 7.5951 0.6228 9.7380 5.7609 9.8689 30.4314 28.5397 63.7666 19.6878 19.3489 9.2424 34.8189 18.0674 4.9997 9.5827 52.6924 6.4071 232.5472 11.3944 14.5016 49.9453 1.9111 6.0260 8.3203 5.2770 5.0567 32.6509 0.8314 50.7232 54.6810 103.4050 74.3112 66.9581 11.9081 60.5246 24.1552 13.3365 26.0331 17.6015 1.0949 46.9284 35.7780 53.8068 40.4540 0.0146 10.3496 8.7393 3.0583 17.3600 5.2573 18.1544
temp: 298.150 k
press: 1.00000 atm
elementType: 16 8 8 8 7 6 6 6 6 6 6 6 6 6 6 6 6 6 6 6 6 6 6 6 1 1 1 1 1 1 1 1 1 1 1 1 1 1 1 1 1 1 1 1 1
symmnumber: 1
zpe: 936140.6 jmol-1
zpe.correction: 0.356557 hartree
zpe.thermalcorrener: 0.380218 hartree
zpe.thermalcorrenthalpy: 0.381162 hartree
zpe.thermalcorrgfe: 0.299424 hartree
zpe.sumelectzpe: -1413.292986 hartree
zpe.sumelectthermal: -1413.269325 hartree
zpe.sumelectthermalent: -1413.268381 hartree
zpe.sumelectthermalfe: -1413.350119 hartree
dipole: -2.3733 0.0635 0.1958
dipole: 2.3822
quadrupole: -108.9175 -139.1742 -151.4656
quadrupole: 6.1085 -4.3692 4.0121
quadrupole: 24.2683 -5.9885 -18.2798 6.1085 -4.3692 4.0121
hfenergy: -1413.649543 hartree
pointgroup: C01 [X(C19H21N1O3S1)]
dipole: -0.9167547 -0.1653682 0.1031236 debye
polarizability: 413.9682359|20.5806914|157.2908213|-1.6588269|-32.9125521|221.3668523 unknown
InChI: InChI=1S/C19H21NO3S/c1-3-21-19(22-4-2)13-20-12-14-9-10-16-18(11-14)24-17-8-6-5-7-15(17)23-16/h5-12,19H,3-4,13H2,1-2H3
charge 0 multiplicity 1
45 atoms
S  2.913352 0.603002 -2.183819
O  3.725922 -0.80868 0.555207
O  -4.570018 -1.400057 -0.353226
O  -4.777383 0.423045 1.09562
N  -2.422964 0.691786 -1.003241
C  -4.858775 0.044546 -0.2903
C  1.826196 0.115663 -0.784706
C  -3.874673 0.924536 -1.099219
C  2.35057 -0.533635 0.362191
C  -0.439468 -0.12748 0.128073
C  0.442285 0.328768 -0.88945
C  4.508624 0.693139 -1.282116
C  4.720127 -0.016979 -0.078053
C  1.490031 -0.981353 1.384152
C  0.099925 -0.789161 1.262021
C  -1.900235 0.079207 0.026861
C  -4.500209 -1.985508 -1.705922
C  -5.807567 -0.21155 1.952041
C  5.571301 1.436676 -1.841209
C  5.978222 0.000409 0.556774
C  6.839789 1.447314 -1.218314
C  7.043745 0.724849 -0.019842
C  -5.832579 -1.94661 -2.475686
C  -5.695492 0.423838 3.336174
H  -5.897293 0.218076 -0.667655
H  -4.073279 1.975236 -0.805695
H  -4.141704 0.851987 -2.171656
H  0.006338 0.839173 -1.754725
H  1.930808 -1.476538 2.254065
H  -0.571567 -1.1458 2.051413
H  -2.507034 -0.310166 0.864312
H  -3.691703 -1.495171 -2.286511
H  -4.198067 -3.029841 -1.518109
H  -6.808982 -0.03046 1.502292
H  -5.630735 -1.302399 1.982601
H  5.406153 1.999546 -2.76629
H  6.098518 -0.560002 1.488585
H  7.658779 2.018318 -1.667267
H  8.023353 0.729361 0.468898
H  -5.733985 -2.519725 -3.416485
H  -6.641718 -2.402477 -1.878021
H  -6.132629 -0.917412 -2.744398
H  -6.441131 -0.018302 4.022023
H  -4.690117 0.253128 3.758723
H  -5.867233 1.512705 3.283387
