program: Gaussian 09
title: 000290845
version: EM64L-G09RevD.01
frameworkgroup: C1[X(C16H16N2O3)]
method: RPBEPBE
basis: SDD
operation: Freq
keyword: #p
keyword: freq=noraman
keyword: PBEPBE/SDD
title: #p freq=noraman PBEPBE/SDD
converged: YES YES NO NO
title: Mulliken charges:
elementType: O O O N N C C C C C C C C C C C C C C C C H H H H H H H H H H H H H H H H
charge: -0.264168 -0.214364 -0.168772 -0.264881 -0.008335 -0.560382 0.252065 0.491807 0.351952 0.199374 0.202736 -0.312136 -0.403228 -0.379417 -0.826432 -0.255842 -0.348566 -0.236964 -0.222215 -0.774823 -0.226693 0.230442 0.307163 0.268842 0.237607 0.234055 0.231433 0.249958 0.233555 0.236247 0.273822 0.229897 0.236866 0.243232 0.253602 0.259925 0.242637
chargesum: 0.00000
title: Mulliken charges with hydrogens summed into heavy atoms:
elementType: O O O N N C C C C C C C C C C C C C C C C
charge: -0.264168 -0.214364 -0.168772 -0.264881 -0.008335 -0.022777 0.252065 0.491807 0.351952 0.199374 0.202736 -0.043294 -0.165621 -0.145362 -0.111486 -0.019595 -0.074744 -0.007067 0.014651 -0.018065 0.015945
polarizability: 1.81873904e+02 1.28150718e+01 2.08807902e+02 -1.57966991e+01 -6.38709300e-01 1.82689507e+02
1716.lowfreq: -10.0484 -5.9187 -0.0001 0.0006 0.0007 5.6582 23.7503 33.2762 43.7112
frequency: 18.4315 33.2408 43.6877 55.7355 64.5705 83.2755 94.0297 97.6296 114.4923 128.1631 137.2467 175.1624 190.5178 247.8811 250.6512 303.1363 332.3253 344.7986 367.1586 380.6879 401.5385 429.5435 463.7390 470.3465 509.4018 540.0651 551.8331 563.9207 574.3033 614.5702 620.7764 649.1366 670.4998 689.3749 733.4918 746.9014 763.3012 776.2464 780.1990 793.8453 835.2693 877.6592 882.3368 909.6504 956.2121 960.4518 968.5255 980.5435 993.4410 995.0223 1007.9193 1032.4891 1038.6799 1041.9582 1046.7363 1067.8073 1075.0681 1117.9509 1141.7539 1175.3935 1176.6739 1195.7997 1210.8591 1224.4231 1226.9391 1252.1727 1278.1960 1284.1593 1339.0201 1355.8355 1366.7245 1368.5486 1381.9949 1392.4569 1400.3647 1433.8192 1437.4231 1447.3539 1460.3806 1464.8026 1471.6913 1477.4025 1483.9007 1487.7703 1583.3032 1584.7812 1593.4233 1610.8335 1612.8347 2974.5173 2984.8431 3000.1221 3047.5089 3056.4578 3087.1773 3092.9789 3121.0094 3129.6496 3133.6164 3134.8907 3146.6791 3148.5124 3164.1689 3165.1204 3180.1321
redmass: 4.2059 6.6166 5.8053 5.9297 2.1957 1.8076 4.3966 3.5639 1.0521 4.6447 4.6401 3.9365 5.0283 5.5675 4.8167 3.8503 3.3400 2.6403 5.4551 6.2704 4.1302 3.0920 3.0585 3.9802 4.1033 4.6569 4.3723 4.2236 3.5627 4.6162 4.8683 7.0836 6.0688 4.2278 2.6872 2.3934 7.2311 1.6628 1.5777 4.3957 4.5252 1.3129 1.4397 2.6333 1.3741 1.4098 2.0272 1.5545 1.3269 1.3726 2.7414 1.6713 2.5083 1.6115 2.1190 4.1096 2.5923 1.7568 1.7754 1.0557 1.0669 1.9415 2.2899 2.1602 4.7340 2.7618 1.5817 1.5529 3.0221 1.6070 7.7892 6.8671 1.2578 5.1392 1.2279 2.0879 2.2579 1.1008 1.0526 1.2110 1.7799 1.2154 1.2633 2.0346 6.2354 6.3576 7.4613 6.9900 6.5251 1.0417 1.0615 1.0372 1.0970 1.0917 1.0975 1.0998 1.0870 1.0883 1.1000 1.0886 1.0945 1.0899 1.0944 1.1008 1.0994
irintensity: 0.1482 1.1497 0.9641 0.7435 0.5675 1.0295 3.1778 1.7632 0.6257 2.2064 0.1794 2.4030 5.4273 4.5300 1.1191 3.4620 3.0678 3.8215 4.9454 7.6281 1.4146 1.2690 5.4457 1.9251 8.5946 3.7524 1.3798 8.9087 7.3804 7.3320 9.3503 11.9499 14.3235 7.1002 29.3024 13.5704 6.9094 36.4505 49.9954 4.0809 7.1129 0.6651 0.2125 4.6350 0.6165 2.4979 14.5448 1.9985 0.0250 0.2374 8.8466 6.9183 18.5642 5.9151 6.3493 3.2930 9.3873 12.3293 1.7453 0.4467 3.9811 17.6792 24.1915 127.5924 78.7229 61.0541 42.3120 13.7533 83.3943 0.8728 33.7181 87.2117 39.1286 16.4264 14.8886 4.2058 10.2252 35.0005 21.9987 9.4310 14.6361 28.4292 9.9249 64.2615 25.3940 6.3865 174.7536 13.9784 12.9256 17.7843 44.3127 6.7991 32.6858 18.5446 9.1164 16.0880 6.9364 5.0109 12.3040 6.0602 16.4179 9.1347 10.8254 20.2350 9.8955
temp: 298.150 k
press: 1.00000 atm
elementType: 8 8 8 7 7 6 6 6 6 6 6 6 6 6 6 6 6 6 6 6 6 1 1 1 1 1 1 1 1 1 1 1 1 1 1 1 1
symmnumber: 1
zpe: 754137.8 jmol-1
zpe.correction: 0.287236 hartree
zpe.thermalcorrener: 0.306879 hartree
zpe.thermalcorrenthalpy: 0.307823 hartree
zpe.thermalcorrgfe: 0.237119 hartree
zpe.sumelectzpe: -952.896963 hartree
zpe.sumelectthermal: -952.877320 hartree
zpe.sumelectthermalent: -952.876375 hartree
zpe.sumelectthermalfe: -952.947080 hartree
dipole: 0.7572 -7.2010 -1.0639
dipole: 7.3184
quadrupole: -108.7901 -133.5528 -118.9435
quadrupole: 5.7090 2.0879 4.9650
quadrupole: 11.6387 -13.1240 1.4853 5.7090 2.0879 4.9650
hfenergy: -953.1841985 hartree
pointgroup: C01 [X(C16H16N2O3)]
dipole: -0.6475613 2.7544364 -0.5330107 debye
polarizability: 180.6495029|10.2100261|211.5656846|15.1956823|0.5108388|181.1561266 unknown
InChI: InChI=1S/C16H16N2O3/c1-12-7-3-5-9-15(12)17(13(2)19)11-14-8-4-6-10-16(14)18(20)21/h3-10H,11H2,1-2H3
charge 0 multiplicity 1
37 atoms
O  -0.762661 -3.309369 -0.889266
O  2.222255 -0.961332 2.139673
O  1.971488 -2.266961 0.284776
N  -0.820305 -1.03256 -0.391778
N  2.088726 -1.121407 0.860361
C  0.165855 -0.778621 -1.476467
C  -1.473373 0.095132 0.248732
C  1.233697 0.234621 -1.095437
C  -2.531242 0.78302 -0.416606
C  2.107971 0.097795 0.016128
C  -1.231417 -2.365197 -0.186557
C  -1.049946 0.499067 1.538083
C  1.364849 1.424653 -1.852535
C  -3.135371 1.878771 0.25148
C  -3.015131 0.367128 -1.794434
C  -1.666709 1.590929 2.184978
C  3.046403 1.087765 0.378965
C  -2.712664 2.285442 1.536239
C  2.319465 2.414779 -1.531661
C  -2.254579 -2.604827 0.916621
C  3.161814 2.250331 -0.408248
H  -0.351151 -0.414004 -2.385294
H  0.598733 -1.768767 -1.708758
H  -0.23662 -0.045642 2.030085
H  0.69339 1.577445 -2.70531
H  -3.955106 2.41341 -0.24383
H  -2.417125 0.847199 -2.593984
H  -2.941699 -0.723894 -1.945239
H  -4.065118 0.668154 -1.951038
H  -1.331679 1.894994 3.182288
H  3.672749 0.930232 1.261641
H  -3.200352 3.133803 2.029103
H  2.395487 3.317219 -2.147294
H  -3.142043 -1.957146 0.80787
H  -1.816678 -2.398419 1.909311
H  -2.55775 -3.660957 0.873426
H  3.896733 3.017719 -0.145927
