program: Gaussian 09
title: 000290842
version: EM64L-G09RevD.01
frameworkgroup: C1[X(C15H14ClNO3)]
method: RPBEPBE
basis: SDD
operation: Freq
keyword: #p
keyword: freq=noraman
keyword: PBEPBE/SDD
title: #p freq=noraman PBEPBE/SDD
converged: YES YES NO NO
title: Mulliken charges:
elementType: Cl O O O N C C C C C C C C C C C C C C C H H H H H H H H H H H H H H
charge: -0.073558 -0.417243 -0.283405 -0.308954 -0.513268 -0.514849 0.356054 0.330384 0.072830 0.091452 -0.403002 -0.337660 -0.308075 -0.322334 -0.229969 -0.109641 -0.254371 -0.204385 0.208203 -0.497313 0.236297 0.244899 0.370670 0.259843 0.236270 0.273434 0.256380 0.230717 0.235879 0.256076 0.394165 0.246386 0.243839 0.234249
chargesum: 0.00000
title: Mulliken charges with hydrogens summed into heavy atoms:
elementType: Cl O O O N C C C C C C C C C C C C C C C
charge: -0.073558 -0.023078 -0.283405 -0.308954 -0.142597 -0.033653 0.356054 0.330384 0.072830 0.091452 -0.143159 -0.101390 -0.034642 -0.065955 0.000748 -0.109641 -0.018491 0.051691 0.208203 0.227161
polarizability: 2.80421860e+02 -1.90024427e+01 1.86695447e+02 1.21774895e+01 1.02758253e+01 1.30358414e+02
1716.lowfreq: -8.0720 -5.0731 -1.8800 -0.0015 -0.0012 -0.0010 23.0624 29.5932 43.3674
frequency: 23.0208 29.5874 43.3488 77.7541 98.9913 110.8709 127.6655 130.9392 143.8811 166.0106 189.2695 198.4558 221.8947 271.3915 289.4318 322.1862 332.5179 349.1330 361.9366 407.3862 434.5220 443.4523 453.3814 521.3982 527.7955 552.2273 562.9955 624.5166 635.3886 663.7198 678.2491 698.7971 723.0940 752.4510 761.4016 771.1940 773.1677 819.4620 828.5727 861.6458 866.4615 879.9811 918.4200 937.1788 944.7613 966.6190 987.4436 991.3127 1043.9866 1045.5296 1071.2471 1075.7619 1105.9514 1113.9608 1138.5777 1150.6081 1177.6643 1184.1598 1206.8560 1215.2169 1238.3950 1261.6288 1271.4815 1310.6465 1329.4834 1338.5894 1384.5823 1400.4728 1424.1357 1429.7262 1439.3439 1445.0227 1452.3716 1463.8012 1467.8082 1479.1882 1503.6465 1576.7680 1582.9567 1592.0104 1625.5909 1629.9214 2959.1899 3007.1955 3010.0384 3110.2372 3135.2047 3149.4349 3151.3668 3157.9317 3161.6563 3171.3786 3181.4098 3182.4765 3191.8244 3273.0819
redmass: 7.5155 5.5476 5.7911 4.9000 2.2398 1.9049 5.3481 3.0802 4.3834 6.4102 4.6729 4.5488 3.2653 4.7196 5.7135 6.5724 4.5051 6.9494 10.6321 5.3447 3.4947 3.9115 3.8872 3.9515 3.4162 4.2710 5.7341 6.6683 6.3525 5.5505 4.3569 1.2514 3.6671 4.7022 2.3741 1.8653 4.9913 1.5610 3.3954 1.5272 2.2182 1.9201 5.0705 1.3721 1.3401 1.3701 1.8934 1.3468 5.3108 2.2055 3.7933 2.1742 1.7634 1.2602 1.6644 1.5073 1.0709 1.9485 1.2949 2.0404 2.1156 1.4215 2.2342 1.8489 2.0339 1.5130 4.7949 3.4278 1.4931 2.4696 2.2095 2.2396 1.0496 1.0559 1.8705 1.4082 2.5200 6.7507 6.3959 3.2808 5.7910 5.7747 1.0581 1.0294 1.1031 1.1047 1.0869 1.0926 1.1050 1.0902 1.0886 1.0939 1.0974 1.0983 1.0673 1.0792
irintensity: 0.1270 0.3869 0.4304 1.5719 1.2765 5.5546 0.9421 2.1701 11.4670 2.9986 13.1129 9.5503 0.8047 9.4411 10.9266 2.8855 10.1886 22.9575 4.2936 0.9551 0.5577 14.7208 14.1150 17.5553 15.0232 2.4938 3.2809 22.6939 25.7246 27.2136 16.8199 101.6800 1.1361 3.2900 77.8900 31.4391 6.6613 48.0594 53.7889 1.1922 18.8091 32.3211 6.3505 75.6779 12.0449 1.5205 65.0745 2.2550 57.5448 9.4955 85.9786 38.1911 25.5302 0.0840 18.8105 90.0618 2.2515 21.9800 46.2732 94.6828 186.2735 36.8933 252.0799 87.0661 21.7577 14.6874 7.9230 32.2237 45.8710 78.6228 47.3015 7.3975 14.8457 9.2297 219.7722 32.4042 273.1722 63.2092 8.6570 126.5919 28.9582 174.5121 35.8068 38.2095 18.7569 23.6506 7.8642 2.2750 17.7513 15.2999 3.8195 12.9776 15.1498 20.0308 837.8149 129.4606
temp: 298.150 k
press: 1.00000 atm
elementType: 17 8 8 8 7 6 6 6 6 6 6 6 6 6 6 6 6 6 6 6 1 1 1 1 1 1 1 1 1 1 1 1 1 1
symmnumber: 1
zpe: 678849.7 jmol-1
zpe.correction: 0.258560 hartree
zpe.thermalcorrener: 0.276937 hartree
zpe.thermalcorrenthalpy: 0.277881 hartree
zpe.thermalcorrgfe: 0.210255 hartree
zpe.sumelectzpe: -1319.058070 hartree
zpe.sumelectthermal: -1319.039693 hartree
zpe.sumelectthermalent: -1319.038749 hartree
zpe.sumelectthermalfe: -1319.106375 hartree
dipole: 4.1214 -0.8107 -0.8859
dipole: 4.2928
quadrupole: -122.8596 -107.7664 -129.0900
quadrupole: 2.8835 -5.4755 2.2117
quadrupole: -2.9542 12.1389 -9.1847 2.8835 -5.4755 2.2117
hfenergy: -1319.3166301 hartree
pointgroup: C01 [X(C15H14Cl1N1O3)]
dipole: -1.6630704 0.2167844 -0.1990235 debye
polarizability: 277.7911812|-18.7658377|182.0132248|-25.4886745|-15.1834629|137.6713153 unknown
InChI: InChI=1S/C15H14ClNO3/c1-20-15(19)12-4-2-3-5-13(12)17-9-10-8-11(16)6-7-14(10)18/h2-8,17-18H,9H2,1H3
charge 0 multiplicity 1
34 atoms
Cl 5.818958 -0.148947 -2.042793
O  1.462406 0.207288 2.105524
O  -3.548258 -2.278734 0.346058
O  -1.264664 -2.061597 -0.000718
N  -0.247074 0.414928 -0.06954
C  0.882236 1.255005 -0.541205
C  2.211418 0.596646 -0.207367
C  -1.575503 0.87291 -0.055986
C  -2.667065 -0.061141 0.099513
C  2.450192 0.129315 1.120063
C  3.244405 0.497739 -1.166572
C  -1.888179 2.261333 -0.156848
C  -4.001433 0.423582 0.183757
C  3.710663 -0.399746 1.478826
C  -3.217576 2.710217 -0.073783
C  4.491771 -0.033743 -0.791098
C  -4.286474 1.796138 0.104647
C  4.743589 -0.479207 0.52145
C  -2.403382 -1.513882 0.141554
C  -3.339755 -3.745575 0.38821
H  0.828774 2.232704 -0.022428
H  0.809822 1.455229 -1.629627
H  -0.168973 -0.609837 -0.218217
H  3.077714 0.840766 -2.192877
H  -1.089214 2.993175 -0.301345
H  -4.804528 -0.30801 0.30585
H  3.865615 -0.744801 2.504871
H  -3.423618 3.783791 -0.151466
H  -5.318327 2.153665 0.170367
H  5.72121 -0.888021 0.791569
H  0.569609 0.327847 1.648369
H  -2.643784 -4.008584 1.20198
H  -2.926108 -4.100685 -0.570311
H  -4.340268 -4.16227 0.568973
