program: Gaussian 09
title: 000290840
version: EM64L-G09RevD.01
frameworkgroup: C1[X(C14H14N2O2)]
method: RPBEPBE
basis: SDD
operation: Freq
keyword: #p
keyword: freq=noraman
keyword: PBEPBE/SDD
title: #p freq=noraman PBEPBE/SDD
converged: YES YES NO NO
title: Mulliken charges:
elementType: O O N N C C C C C C C C C C C C C C H H H H H H H H H H H H H H
charge: -0.199948 -0.231209 -0.401226 0.012350 -0.603152 0.430764 0.304729 0.308420 0.192474 -0.333936 -0.345632 -0.389190 -0.346953 -0.838649 -0.233348 -0.245085 -0.266711 -0.218035 0.262794 0.222587 0.354490 0.235285 0.200045 0.224587 0.281745 0.227549 0.233781 0.234401 0.240080 0.218768 0.223919 0.244304
chargesum: 0.00000
title: Mulliken charges with hydrogens summed into heavy atoms:
elementType: O O N N C C C C C C C C C C C C C C
charge: -0.199948 -0.231209 -0.046737 0.012350 -0.117770 0.430764 0.304729 0.308420 0.192474 -0.098651 -0.145587 -0.164603 -0.065207 -0.142918 0.006733 -0.026317 -0.042792 0.026269
polarizability: 3.10615805e+02 -2.28533343e+01 1.93086104e+02 -5.30197466e+00 2.35008775e+00 1.13333733e+02
1716.lowfreq: -12.1556 -2.6510 0.0001 0.0004 0.0005 7.6270 18.9261 26.7159 49.7839
frequency: 18.6730 26.6315 49.7651 81.8138 104.6725 142.8564 165.1590 184.2119 194.4094 235.6737 263.4080 287.0686 339.3230 371.3251 390.5303 428.8394 438.5926 465.5810 492.6036 511.5064 531.2532 542.5145 569.0712 593.3557 610.3032 644.2099 665.4085 714.2426 728.2273 740.7367 751.4394 769.5194 781.1564 815.7007 823.8764 834.9217 887.6352 923.1728 954.2282 964.0089 970.6004 980.7755 998.9454 1040.6175 1041.3979 1051.1051 1060.3158 1065.6816 1126.2684 1141.8097 1171.7761 1176.7883 1190.2008 1192.5026 1198.5505 1223.6308 1281.7089 1292.2588 1308.4442 1350.1722 1356.1800 1378.5634 1390.4628 1398.3077 1432.4834 1441.6386 1453.6441 1463.8593 1473.7158 1485.3433 1488.5705 1511.4076 1577.5425 1585.1398 1604.9021 1618.3899 2953.3446 3020.4790 3032.0096 3085.0953 3086.7628 3117.2765 3125.2794 3139.2859 3146.3696 3153.8099 3163.8908 3167.7027 3184.5377 3545.2819
redmass: 5.5416 4.5897 5.1771 9.8866 4.1985 4.1826 5.9643 2.8327 1.2171 4.1844 5.9911 3.8723 4.1483 3.8078 3.4817 3.3572 2.8923 4.0010 3.5967 4.0703 4.1253 3.1530 1.9966 3.8015 2.2954 6.6734 5.3611 2.0326 3.5745 3.9615 1.7445 5.6822 1.4781 3.9459 4.1148 1.4483 1.5171 1.3602 1.8122 1.3120 1.4205 1.6264 1.3485 2.0228 1.9003 2.1980 4.1123 3.3575 1.8239 1.8467 1.0784 1.1029 2.8215 2.6242 3.4771 1.3019 1.7467 1.4952 1.6394 5.4815 1.4079 3.4004 5.9965 1.3393 2.2535 1.8802 1.9782 2.1163 1.0457 1.1996 1.2645 2.2991 6.3390 5.4746 6.6349 6.2645 1.0397 1.0971 1.0595 1.1034 1.0954 1.0866 1.0878 1.0868 1.0921 1.0911 1.1000 1.0959 1.0980 1.0757
irintensity: 1.0514 0.8005 1.2117 0.7697 0.5381 0.8523 2.1390 1.2812 3.3703 1.7709 4.1483 0.6294 2.1423 1.3814 10.1952 1.8835 2.3342 1.7000 9.4009 4.0467 6.0743 6.1167 47.4237 6.2821 74.7901 2.9840 18.9779 10.1357 24.7911 4.7717 71.1635 12.3132 60.2788 20.1344 4.1351 1.3358 2.6740 1.1999 4.3780 0.0752 7.8152 3.1202 0.7740 5.4883 2.4861 9.0447 7.6554 9.9346 6.0155 8.3704 1.6054 18.6764 87.3562 134.3203 191.7152 48.6052 3.2980 3.7558 11.2718 167.3167 18.2706 6.8740 10.5602 17.2657 5.7262 4.6435 11.6894 33.5312 14.7753 15.2221 45.1956 101.9078 21.9001 10.3446 13.9667 46.1257 26.8580 27.0247 34.9347 3.3157 20.6362 20.7516 10.2028 2.9944 37.7961 8.9572 34.1636 12.0567 7.8334 16.4259
temp: 298.150 k
press: 1.00000 atm
elementType: 8 8 7 7 6 6 6 6 6 6 6 6 6 6 6 6 6 6 1 1 1 1 1 1 1 1 1 1 1 1 1 1
symmnumber: 1
zpe: 660831.8 jmol-1
zpe.correction: 0.251698 hartree
zpe.thermalcorrener: 0.267456 hartree
zpe.thermalcorrenthalpy: 0.268401 hartree
zpe.thermalcorrgfe: 0.206851 hartree
zpe.sumelectzpe: -800.473739 hartree
zpe.sumelectthermal: -800.457980 hartree
zpe.sumelectthermalent: -800.457036 hartree
zpe.sumelectthermalfe: -800.518585 hartree
dipole: 0.4337 3.9329 -0.4464
dipole: 3.9818
quadrupole: -110.6564 -101.6412 -102.6948
quadrupole: 13.0041 -1.2958 2.4660
quadrupole: -5.6590 3.3563 2.3027 13.0041 -1.2958 2.4660
hfenergy: -800.7254363 hartree
pointgroup: C01 [X(C14H14N2O2)]
dipole: 0.4148967 -1.4458287 -0.4376721 debye
polarizability: 300.575259|35.4159621|186.9053082|19.1627013|34.7431833|129.5550756 unknown
InChI: InChI=1S/C14H14N2O2/c1-11-6-2-4-8-13(11)15-10-12-7-3-5-9-14(12)16(17)18/h2-9,15H,10H2,1H3
charge 0 multiplicity 1
32 atoms
O  3.541023 2.270471 1.293533
O  1.341796 2.456281 0.741304
N  -0.759817 0.901261 -0.35644
N  2.448878 1.777833 0.81153
C  0.402281 0.701609 -1.228418
C  1.501121 -0.140247 -0.566447
C  -1.847241 0.028437 -0.218835
C  -2.784799 0.265683 0.846694
C  2.454974 0.364675 0.367466
C  1.607346 -1.517907 -0.889134
C  -2.078893 -1.055736 -1.114554
C  -3.905141 -0.583686 0.968573
C  3.461642 -0.451487 0.939107
C  -2.569268 1.418267 1.810876
C  2.591804 -2.350084 -0.315955
C  -3.210061 -1.884735 -0.967529
C  -4.133389 -1.659051 0.076726
C  3.525994 -1.814882 0.602356
H  0.793903 1.693679 -1.507061
H  0.086902 0.206304 -2.16164
H  -0.605964 1.607931 0.364712
H  0.899785 -1.94101 -1.609897
H  -1.387944 -1.248798 -1.941496
H  -4.615604 -0.395859 1.783371
H  4.170422 0.000391 1.638085
H  -1.601011 1.339796 2.346578
H  -2.576195 2.398359 1.292627
H  -3.364461 1.444037 2.574096
H  2.634575 -3.40973 -0.589122
H  -3.366962 -2.708792 -1.673268
H  -5.011198 -2.30222 0.196495
H  4.2941 -2.45269 1.050573
