program: Gaussian 09
title: 000290835
version: EM64L-G09RevD.01
frameworkgroup: C1[X(C12H17N3O7)]
method: RPBEPBE
basis: SDD
operation: Freq
keyword: #p
keyword: freq=noraman
keyword: PBEPBE/SDD
title: #p freq=noraman PBEPBE/SDD
converged: YES YES NO NO
title: Mulliken charges:
elementType: O O O O O O O N N N C C C C C C C C C C C C H H H H H H H H H H H H H H H H H
charge: -0.237637 -0.419118 -0.464917 -0.426140 -0.243719 -0.349042 -0.262227 -0.200609 -0.054781 -0.614737 -0.155310 -0.167423 -0.151028 -0.067993 -0.386572 -0.188191 0.079945 0.016730 0.103516 0.237895 -0.254789 -0.659690 0.274648 0.286485 0.309881 0.248616 0.228620 0.214532 0.353338 0.361018 0.368418 0.346125 0.336099 0.375042 0.244222 0.220782 0.221213 0.224492 0.252304
chargesum: 0.00000
title: Mulliken charges with hydrogens summed into heavy atoms:
elementType: O O O O O O O N N N C C C C C C C C C C C C
charge: -0.237637 -0.065779 -0.103899 -0.080015 -0.243719 -0.349042 -0.262227 -0.200609 -0.054781 0.096404 0.119339 0.119061 0.158853 0.180623 0.056580 0.180227 0.079945 0.016730 0.103516 0.237895 0.210216 0.038319
polarizability: 2.49341219e+02 -1.93400218e+01 1.88361255e+02 -1.03855190e+01 -3.88005091e+00 1.16846561e+02
1716.lowfreq: -10.9971 -2.2823 -0.0004 0.0005 0.0006 6.4810 13.8417 25.3597 32.6740
frequency: 12.3451 25.3233 32.6047 48.6850 59.7020 75.8663 86.9231 95.8374 101.4153 112.6658 167.5680 177.3993 200.8448 211.3608 224.4840 233.9502 246.3619 270.7026 298.7658 303.5233 325.7989 332.8521 355.1107 362.5309 376.1406 386.2648 408.2046 427.2716 442.4939 454.0312 487.5796 528.2445 560.4073 606.5664 608.3522 624.0178 650.2548 672.3585 698.4519 700.6767 727.5694 732.1791 757.7676 764.6346 803.9664 816.0263 845.2002 859.9381 890.2027 921.0654 944.1166 958.5813 973.0633 991.1332 1000.3282 1013.6731 1016.4273 1040.5562 1046.0865 1048.7603 1081.4506 1097.0360 1103.6777 1132.9166 1154.4371 1192.8132 1199.3709 1209.9140 1214.5142 1245.7510 1258.5602 1274.0309 1280.1262 1299.0052 1308.6729 1329.6039 1340.3574 1341.4692 1356.2850 1358.7514 1367.8698 1390.9737 1393.5269 1429.1733 1457.3787 1462.8223 1473.9460 1475.9475 1483.7187 1488.4797 1578.8769 1607.7699 1629.5926 1661.6798 2986.9377 2993.6732 2994.8838 3034.8735 3036.0581 3070.7369 3078.0482 3085.2840 3087.8957 3088.1800 3095.5119 3120.5066 3468.5807 3537.3826 3562.5574 3585.0843 3649.8822
redmass: 6.0540 5.0247 3.8613 6.1736 4.3597 5.9791 4.1779 5.1174 4.2570 5.2933 2.6910 4.7402 4.8603 4.2686 2.4451 2.9312 5.1571 2.3863 3.4274 2.0343 3.5086 1.2609 3.7244 1.2100 2.7659 5.4714 4.4778 3.4469 3.5967 6.2907 5.6004 5.6374 8.3156 5.3585 1.3879 6.4682 5.8590 2.5359 2.7444 2.4063 4.8892 4.3667 6.0708 6.7049 2.5242 1.8058 2.4937 3.5921 4.8529 3.2131 4.6949 3.3946 4.3653 4.2438 4.7163 3.0077 4.2955 1.3818 1.9438 2.3221 4.5519 2.2256 1.6734 1.1484 1.6617 2.0467 1.5973 1.3247 2.0589 3.0265 1.2823 1.5133 1.1218 1.6961 1.3548 1.5195 1.5904 1.3267 1.2711 1.2685 1.2624 1.2321 1.5064 1.5996 1.1081 1.0451 1.0906 5.7420 1.0557 2.5662 1.8366 4.7034 6.2156 9.3539 1.0845 1.0362 1.0649 1.0588 1.0869 1.0986 1.0866 1.0998 1.0896 1.0981 1.1029 1.1066 1.0474 1.0663 1.0663 1.0666 1.1033
irintensity: 0.2154 0.1576 2.0782 1.7608 3.7302 2.5282 1.0012 2.8198 1.7663 2.4523 4.5369 2.6133 2.6070 10.1586 3.9257 3.1831 16.1015 81.9037 70.0510 55.3976 28.7520 76.7851 13.4288 170.0721 5.4162 45.2399 11.5661 10.0518 6.9929 7.1085 18.9465 16.1010 15.2267 26.3710 154.4559 9.8210 3.7894 54.2960 21.1934 16.7286 17.7558 28.6543 24.1981 69.1323 14.4140 9.1399 16.9239 7.8638 31.0184 23.4591 116.4045 151.8074 80.9262 32.7007 117.5704 174.0270 119.9536 20.2408 16.9915 31.4815 410.5613 9.5495 4.7311 36.7644 27.6862 97.7656 3.6358 2.2418 64.3492 119.7310 19.9383 47.0590 0.8179 4.4781 25.5869 7.8910 33.9993 29.7483 3.7118 20.7410 17.7998 28.2975 1.6420 65.7932 18.4048 15.7308 3.7523 101.8487 17.1560 102.7625 139.2398 429.2006 359.6542 742.8592 20.7747 20.4987 38.5353 36.4842 17.4806 77.7346 35.0213 25.3013 22.3067 29.8558 5.1294 26.9086 164.9842 14.7163 10.9812 15.2296 110.8837
temp: 298.150 k
press: 1.00000 atm
elementType: 8 8 8 8 8 8 8 7 7 7 6 6 6 6 6 6 6 6 6 6 6 6 1 1 1 1 1 1 1 1 1 1 1 1 1 1 1 1 1
symmnumber: 1
zpe: 785359.1 jmol-1
zpe.correction: 0.299127 hartree
zpe.thermalcorrener: 0.321474 hartree
zpe.thermalcorrenthalpy: 0.322418 hartree
zpe.thermalcorrgfe: 0.245385 hartree
zpe.sumelectzpe: -1156.607660 hartree
zpe.sumelectthermal: -1156.585314 hartree
zpe.sumelectthermalent: -1156.584370 hartree
zpe.sumelectthermalfe: -1156.661403 hartree
dipole: 4.2379 -5.4835 -0.2829
dipole: 6.9360
quadrupole: -103.1604 -151.0106 -126.4129
quadrupole: 0.2594 -0.8366 -0.4234
quadrupole: 23.7009 -24.1493 0.4484 0.2594 -0.8366 -0.4234
hfenergy: -1156.9067877 hartree
pointgroup: C01 [X(C12H17N3O7)]
dipole: 1.6548394 -2.0424355 0.7325219 debye
polarizability: 249.4766191|-21.0210897|175.8414356|0.3434727|-27.8798893|129.2309798 unknown
InChI: InChI=1S/C12H17N3O7/c1-2-21-11(19)5-3-15(12(20)14-9(5)13)10-8(18)7(17)6(4-16)22-10/h3,6-8,10,16-18H,2,4,13H2,1H3
charge 0 multiplicity 1
39 atoms
O  -2.661998 0.277915 -1.257183
O  -3.690073 1.320617 1.498539
O  -1.61085 -1.753351 1.299377
O  -4.537716 -2.886141 -0.528637
O  -0.807946 3.323279 -1.483831
O  3.872509 -0.802234 -0.230908
O  2.066126 -1.846819 0.817283
N  -0.511765 1.195732 -0.48894
N  1.355207 2.419071 -1.485813
N  3.491757 1.545285 -1.470711
C  -2.465959 0.622994 1.094994
C  -2.735683 -0.902976 0.8789
C  -1.978246 1.14677 -0.280592
C  -2.856793 -1.073027 -0.655407
C  -4.220899 -1.590554 -1.140651
C  0.335298 0.196709 -0.106266
C  0.010987 2.409647 -1.20269
C  1.706311 0.24399 -0.371071
C  2.181267 1.413254 -1.116197
C  2.507815 -0.887161 0.134769
C  4.760689 -1.897977 0.271509
C  5.267172 -1.585331 1.681593
H  -1.753728 0.81482 1.912652
H  -3.662254 -1.191782 1.408047
H  -2.319526 2.174008 -0.48787
H  -2.043654 -1.748965 -0.990999
H  -4.230404 -1.641181 -2.247474
H  -5.029142 -0.914894 -0.815349
H  -4.326553 1.331353 0.736746
H  -1.604008 -1.857626 2.283162
H  -0.08394 -0.666673 0.43092
H  -3.864178 -3.556679 -0.808666
H  3.755101 2.38365 -1.986947
H  4.15552 0.810992 -1.214042
H  4.188343 -2.840828 0.247627
H  5.577122 -1.929988 -0.468128
H  5.981598 -2.366906 2.000293
H  5.786104 -0.611638 1.711772
H  4.432186 -1.569453 2.40139
