program: Gaussian 09
title: 000290828
version: EM64L-G09RevD.01
frameworkgroup: C1[X(C21H22ClN5O2)]
method: RPBEPBE
basis: SDD
operation: Freq
keyword: #p
keyword: freq=noraman
keyword: PBEPBE/SDD
title: #p freq=noraman PBEPBE/SDD
converged: YES YES NO NO
title: Mulliken charges:
elementType: Cl O O N N N N N C C C C C C C C C C C C C C C C C C C C C H H H H H H H H H H H H H H H H H H H H H H
charge: -0.044470 -0.264926 -0.289271 -0.137061 -0.091059 -0.113016 -0.636347 -0.592719 0.299998 0.047397 0.451433 -0.449257 0.477552 0.276854 -0.366047 -0.443551 -0.466033 0.097948 -0.327561 -0.327105 -0.440173 0.126440 -0.380214 0.125771 -0.217184 -0.774200 -0.051982 -0.615073 -0.631846 0.231411 0.223852 0.269906 0.268143 0.275713 0.256941 0.234419 0.270007 0.231560 0.235894 0.234162 0.250304 0.223052 0.279508 0.223596 0.266081 0.237893 0.227445 0.324486 0.339434 0.327633 0.324259
chargesum: 0.00000
title: Mulliken charges with hydrogens summed into heavy atoms:
elementType: Cl O O N N N N N C C C C C C C C C C C C C C C C C C C C C
charge: -0.044470 -0.264926 -0.289271 -0.137061 -0.091059 -0.113016 0.027573 0.059173 0.299998 0.047397 0.451433 0.006006 0.477552 0.276854 -0.096141 -0.175408 -0.190319 0.097948 -0.327561 -0.070163 -0.205754 0.126440 -0.110208 0.125771 0.014376 -0.053840 -0.051982 0.111084 0.099573
polarizability: 4.50384451e+02 -9.85183105e+00 2.92388061e+02 -5.96177889e+00 5.54988962e+00 1.64715058e+02
1716.lowfreq: -2.7637 -0.0013 0.0002 0.0007 4.2307 4.8932 10.5122 16.3662 28.4137
frequency: 9.9409 16.3076 28.4000 32.7226 42.3394 50.1743 61.5355 77.6900 86.3178 98.5131 106.1361 116.3679 125.8529 133.2497 149.9316 159.9068 178.9898 198.1467 211.9007 212.8257 224.0918 237.4967 256.0966 262.9355 305.1957 307.7867 324.3269 331.3129 357.1531 364.3264 378.6739 391.1682 418.2960 433.8673 435.6073 443.3845 448.3857 468.1254 508.3823 521.9896 526.5440 532.4882 539.7112 545.7437 563.2478 589.8247 592.9343 616.9042 622.5494 627.7910 663.6861 687.1072 694.6527 712.2605 722.9781 723.7404 727.8693 784.7287 809.8086 814.9019 823.7324 865.1333 890.5133 912.0302 916.5535 932.3220 936.8137 950.5372 954.2986 966.4434 989.2839 991.2012 1008.2462 1012.4777 1034.7951 1040.1847 1052.6762 1068.1834 1068.6748 1076.3273 1096.3942 1101.5555 1133.6091 1141.9785 1153.8848 1180.1944 1182.7299 1201.6363 1228.6923 1233.8007 1250.9667 1263.4543 1283.7577 1301.2649 1303.9508 1334.7890 1356.9258 1376.7444 1382.2145 1389.5301 1395.2730 1401.7942 1412.0276 1429.7077 1431.1664 1442.6795 1456.2042 1467.5239 1467.9368 1470.5336 1472.1860 1476.8371 1478.1846 1488.4210 1495.2543 1503.0392 1518.4944 1547.1149 1559.4074 1559.7961 1598.1367 1600.5487 1609.8164 1614.4545 1616.3482 2944.4015 2964.2783 2969.8059 2988.7123 3007.5512 3037.1565 3043.5371 3076.5073 3117.5544 3119.8416 3121.3675 3125.5016 3138.3126 3146.0300 3162.3222 3164.1439 3166.1329 3168.4030 3544.3284 3563.0838 3698.9123 3723.8152
redmass: 7.8430 4.9637 5.5304 5.7958 5.1041 5.2588 4.9608 3.5051 4.6928 1.9715 1.4479 5.2757 1.4192 3.7505 4.7964 1.4453 3.4351 4.1454 4.0314 6.7449 3.4448 3.9408 3.3203 4.0200 2.9387 3.3760 3.9009 3.8968 5.1222 4.8029 5.3259 3.8463 3.1258 4.5578 1.6200 1.6882 1.3585 3.2864 3.9062 2.1256 1.5571 2.4105 2.5844 2.2121 4.5293 4.1309 4.3556 4.0929 6.0325 6.2205 7.0864 4.2132 5.9564 6.9870 4.4322 2.4029 5.7205 8.4288 1.8506 1.6950 3.6731 4.6470 1.4342 3.3101 1.4588 1.5476 2.0980 1.3669 2.3576 7.6620 1.8664 2.8060 3.9518 1.7398 2.4663 1.5987 1.3925 2.0170 2.6273 2.1861 1.2254 1.5993 2.3180 1.3919 1.3860 1.5320 1.2228 1.1070 2.0581 4.4619 2.2983 3.0002 2.5358 6.3495 1.2966 3.9664 1.8762 3.0898 3.4493 3.9583 1.5063 4.2817 1.2415 3.1940 2.5576 1.2412 1.1389 1.2395 1.0972 1.3126 1.1121 2.0209 2.0512 1.0556 2.7591 1.3233 4.4604 7.2770 4.8722 4.7654 1.4792 6.2026 6.0324 1.6388 5.7138 1.0572 1.0372 1.0376 1.0406 1.1042 1.1013 1.1004 1.0921 1.1009 1.0886 1.0973 1.0960 1.0885 1.0915 1.0924 1.0920 1.0946 1.0974 1.0442 1.0439 1.1050 1.1059
irintensity: 0.3378 1.3032 0.4359 0.9994 4.1687 0.2609 2.1410 0.4859 1.2346 2.0031 1.7116 0.7203 0.6718 1.0254 2.8533 0.6567 0.6267 10.6200 0.7295 2.3336 2.4816 2.2538 1.3064 3.7462 11.3960 1.0656 3.8222 3.3069 7.6689 4.3651 1.4886 9.4974 7.8524 2.5024 22.1324 63.9492 398.4832 0.8274 2.3637 15.5354 4.4604 2.1300 15.7276 10.7199 5.8029 16.7184 13.0306 7.2154 6.9788 9.2653 1.3919 9.9226 4.9565 3.0915 5.0873 69.2511 29.3595 18.7316 9.1983 39.5027 21.7943 0.8679 14.1863 1.9129 6.7653 3.8170 4.5232 0.4354 8.9732 115.0132 0.4121 0.9244 28.1079 1.9751 23.5783 11.0565 12.6224 90.2354 1.6446 0.5839 0.1174 1.9255 6.3109 1.1276 24.7840 32.0090 28.2966 6.4979 203.8483 14.6633 112.0744 168.7962 6.7153 29.1910 9.6701 22.3337 28.7926 5.2245 83.2771 43.7046 24.6711 1.1605 46.0160 174.5675 7.2031 9.5104 7.5609 207.4439 59.4777 17.0843 25.7620 8.4732 59.7916 25.7148 49.2825 24.2854 211.4506 59.4112 585.3442 99.2146 610.3775 11.9529 26.3702 335.0167 7.8122 28.0063 33.1858 95.2771 10.6567 24.6529 54.2910 24.9874 13.9362 16.8269 9.9429 2.3394 11.3427 11.5310 14.8228 6.1018 5.6819 5.8823 9.5816 60.9811 147.2832 58.0272 44.2007
temp: 298.150 k
press: 1.00000 atm
elementType: 17 8 8 7 7 7 7 7 6 6 6 6 6 6 6 6 6 6 6 6 6 6 6 6 6 6 6 6 6 1 1 1 1 1 1 1 1 1 1 1 1 1 1 1 1 1 1 1 1 1 1
symmnumber: 1
zpe: 1043792.1 jmol-1
zpe.correction: 0.397559 hartree
zpe.thermalcorrener: 0.426048 hartree
zpe.thermalcorrenthalpy: 0.426993 hartree
zpe.thermalcorrgfe: 0.335250 hartree
zpe.sumelectzpe: -1695.648430 hartree
zpe.sumelectthermal: -1695.619941 hartree
zpe.sumelectthermalent: -1695.618997 hartree
zpe.sumelectthermalfe: -1695.710739 hartree
dipole: 3.3706 2.8945 2.0943
dipole: 4.9117
quadrupole: -195.0034 -152.2994 -180.9652
quadrupole: 3.2318 -11.6567 -0.1172
quadrupole: -18.9141 23.7899 -4.8758 3.2318 -11.6567 -0.1172
hfenergy: -1696.0459892 hartree
pointgroup: C01 [X(C21H22Cl1N5O2)]
dipole: -1.3345138 1.1498871 -0.7944154 debye
polarizability: 450.2276469|11.2243635|292.7560625|-5.5010956|-2.2050384|164.5038609 unknown
InChI: InChI=1S/C21H22ClN5O2/c1-12-18(19(23)26-21(24)25-12)14-7-8-17(16(22)10-14)29-11-13-5-4-6-15(9-13)20(28)27(2)3/h4-10H,11,23-24H2,1-3H3
charge 0 multiplicity 1
51 atoms
Cl 0.478628 -1.866422 -1.388387
O  1.338012 0.721655 -0.227031
O  7.261843 -1.003815 1.048768
N  5.663727 -2.072637 -0.271393
N  -6.284402 -1.476453 0.754722
N  -6.624117 0.543069 -0.584297
N  -4.83912 1.829253 -1.332409
N  -8.425642 -0.764727 0.134623
C  -2.878169 0.092784 -0.009205
C  -4.347082 -0.158223 0.043281
C  3.461319 1.777565 0.235588
C  1.960318 1.909316 0.393754
C  -0.044266 0.57755 -0.11942
C  5.484027 0.380392 0.190245
C  -1.992586 -0.85694 -0.594717
C  -2.310625 1.28601 0.512948
C  4.078608 0.506441 0.301067
C  -4.930043 -1.265575 0.720789
C  -0.612655 -0.615438 -0.638641
C  -0.921487 1.529778 0.459665
C  4.259982 2.931442 0.05519
C  -5.271756 0.733555 -0.613337
C  6.279106 1.547244 0.053292
C  6.199291 -0.942378 0.34385
C  5.667192 2.814835 -0.02427
C  -4.106367 -2.293357 1.468512
C  -7.064838 -0.55777 0.099078
C  6.275968 -3.382262 0.015173
C  4.641748 -2.071801 -1.334135
H  1.670499 1.939906 1.465887
H  1.590728 2.831541 -0.098052
H  -2.390454 -1.782647 -1.020943
H  -2.963368 2.023357 0.993142
H  3.448198 -0.376931 0.437417
H  -0.525187 2.45896 0.879329
H  3.789416 3.919935 -0.017396
H  7.368067 1.441024 0.021895
H  6.282457 3.712197 -0.149655
H  -3.890581 -3.165034 0.821498
H  -3.143947 -1.884679 1.816372
H  -4.688061 -2.663121 2.328133
H  5.491807 -4.115947 0.2806
H  6.980267 -3.264541 0.852011
H  6.831511 -3.761583 -0.865169
H  4.457094 -1.053349 -1.703186
H  3.680435 -2.494614 -0.982774
H  5.000566 -2.68805 -2.181092
H  -5.54193 2.397812 -1.799452
H  -3.848787 2.019615 -1.457996
H  -8.784432 -1.572268 0.635942
H  -9.042118 -0.112074 -0.340515
