program: Gaussian 09
title: 000290825
version: EM64L-G09RevD.01
frameworkgroup: C1[X(C23H26ClN5O2)]
method: RPBEPBE
basis: SDD
operation: Freq
keyword: #p
keyword: freq=noraman
keyword: PBEPBE/SDD
title: #p freq=noraman PBEPBE/SDD
converged: YES YES NO NO
title: Mulliken charges:
elementType: Cl O O N N N N N C C C C C C C C C C C C C C C C C C C C C C C H H H H H H H H H H H H H H H H H H H H H H H H H H
charge: -0.039215 -0.258723 -0.277195 -0.135369 -0.090367 -0.114145 -0.638120 -0.593554 -0.379512 -0.331057 0.308767 0.107827 0.414379 -0.501651 -0.474466 0.304305 -0.398487 0.049160 -0.426682 -0.648669 -0.665402 0.492325 -0.210608 -0.419612 -0.401190 -0.342605 -0.327372 0.096818 0.125440 -0.772577 -0.054187 0.254820 0.220651 0.256983 0.199840 0.289856 0.254907 0.214782 0.266386 0.235859 0.216428 0.227590 0.219316 0.210515 0.255312 0.214024 0.231875 0.294004 0.243956 0.255443 0.233081 0.239344 0.249857 0.323999 0.343032 0.323174 0.326711
chargesum: 0.00000
title: Mulliken charges with hydrogens summed into heavy atoms:
elementType: Cl O O N N N N N C C C C C C C C C C C C C C C C C C C C C C C
charge: -0.039215 -0.258723 -0.277195 -0.135369 -0.090367 -0.114145 0.028911 0.056331 0.095959 0.125767 0.308767 0.107827 0.414379 -0.211795 -0.004777 0.304305 -0.132101 0.049160 -0.190823 0.014665 0.014448 0.492325 0.021267 -0.125608 -0.157233 -0.342605 -0.071930 0.096818 0.125440 -0.050295 -0.054187
polarizability: 3.76215726e+02 -4.04042043e+01 2.89472157e+02 3.35033757e+00 1.30391012e+01 2.79175764e+02
1716.lowfreq: -4.5439 0.0010 0.0013 0.0019 1.0987 5.3020 9.2465 14.0734 18.2792
frequency: 8.9684 13.9708 18.2260 27.7354 32.1411 40.4795 42.0127 47.0222 55.9065 64.5115 86.9012 93.0116 114.8831 123.1839 134.1608 145.6306 162.9590 186.6271 199.6862 204.7116 207.8161 211.7479 217.3799 236.6780 244.6353 281.9465 286.7010 303.0656 308.2457 329.6081 337.2529 357.6667 367.2981 375.0017 390.5237 419.8191 430.4392 436.4471 439.8577 452.0808 456.0970 509.1942 513.8860 525.0753 527.6100 534.6096 541.3925 548.7032 567.3314 590.0638 606.9717 612.4630 615.3197 621.2578 662.6093 679.6608 684.1311 696.9116 713.0722 723.6161 724.1096 771.9046 782.3443 784.1017 800.0222 808.6569 816.6989 832.0402 898.1248 907.3708 911.9372 915.9392 936.9205 939.3770 942.3872 947.7199 976.5084 986.6363 989.8322 1007.6841 1009.3138 1014.1420 1038.7977 1040.4407 1066.8137 1067.5498 1075.6106 1079.8404 1084.9236 1097.2015 1102.7627 1132.8742 1156.2287 1167.3149 1181.4518 1206.1674 1212.8923 1221.9965 1240.6735 1253.0118 1280.6038 1289.5396 1298.8168 1300.3862 1306.0849 1333.4262 1343.0975 1345.5275 1358.7997 1375.4826 1381.7596 1384.3873 1388.4554 1395.0421 1401.7254 1407.2429 1427.5474 1430.4827 1454.4199 1455.9521 1466.3598 1468.1359 1469.0835 1470.3473 1473.1213 1474.3775 1476.8391 1483.7252 1484.8475 1491.8906 1517.8023 1550.3719 1550.8102 1557.9126 1595.1989 1597.6228 1608.1823 1612.4887 1614.1439 2979.3274 2983.9359 2985.9850 2989.6346 3000.5868 3012.5933 3054.7096 3066.9656 3075.6029 3076.8580 3082.7731 3085.5794 3102.7997 3105.7108 3115.8547 3118.4433 3140.0423 3143.8542 3145.9506 3154.6524 3165.1862 3171.8345 3544.9110 3563.6066 3699.1981 3724.5272
redmass: 5.4504 5.2427 5.1357 2.9241 5.6434 3.9030 5.2429 3.3158 5.0340 4.2626 2.6690 1.2458 3.7035 4.7383 3.6223 6.6105 5.5668 5.8143 4.0604 2.9063 1.3469 5.0817 1.3248 5.9122 3.8492 3.2902 3.3027 3.1903 2.6762 3.3093 3.0534 3.4879 4.8093 3.7944 9.3828 2.9009 1.6150 2.8658 1.5450 2.4506 2.0586 3.5256 3.4339 1.4110 2.0023 4.6553 1.5434 3.7331 4.1579 3.5002 5.0831 4.6699 4.3626 5.4270 6.8398 6.2276 4.9055 4.4216 6.7401 3.7727 2.6308 1.3677 1.1936 7.6178 2.3411 3.2499 1.5559 2.4588 1.3980 2.5028 3.3258 1.4652 2.0585 1.3803 2.1396 1.3608 6.9775 2.0374 2.5085 2.6356 4.1298 2.0269 1.7841 2.0588 2.0919 2.6589 2.1796 2.0253 1.8437 1.8241 1.6586 2.2920 1.3718 1.9079 1.0898 2.9097 1.7900 2.1025 1.4030 1.7426 1.5911 2.8008 1.3805 6.0296 1.3836 2.8723 1.7923 1.2362 1.2864 3.7317 5.4633 1.2411 1.2209 1.4375 4.2262 2.3004 3.0458 3.1122 1.1421 1.1302 1.0493 1.2451 1.0424 1.2647 1.5762 2.3176 1.3368 1.1196 1.0674 3.2255 4.5442 5.7131 6.9523 4.5472 6.0742 1.4580 6.2784 4.5144 1.7455 1.0634 1.0353 1.0357 1.0407 1.0681 1.0601 1.0992 1.1024 1.0982 1.0918 1.1000 1.0983 1.1011 1.0987 1.0886 1.1009 1.0915 1.0908 1.0886 1.0920 1.0982 1.0950 1.0442 1.0439 1.1050 1.1059
irintensity: 0.2556 0.1821 1.5439 0.2674 0.3817 0.1763 0.5378 1.0361 0.1304 2.2396 1.5859 0.2749 1.2948 0.1676 0.3910 0.6913 1.1286 2.8861 7.0522 3.9424 0.3185 4.5272 0.3371 0.1907 4.9090 0.7993 3.8264 2.0504 6.7944 10.3442 3.3444 3.9018 5.5125 9.2273 0.1688 5.3044 27.4671 40.5388 259.2229 85.7869 76.1276 8.0305 8.4841 10.7917 1.7423 3.4685 17.5130 14.2875 1.1967 26.5285 6.8328 6.3130 5.1031 19.3700 0.6546 5.5350 17.6780 5.2739 1.4808 22.3678 39.7776 4.4597 5.4724 9.5900 62.8274 15.8305 44.1141 12.7824 9.1592 5.1139 1.0194 2.6070 3.5664 14.2115 6.1299 1.3048 81.8400 0.6264 0.6383 1.6174 23.8894 0.3791 32.3231 26.6002 25.5667 4.9136 1.0180 6.6182 30.4982 16.6945 1.3803 5.6399 14.9644 41.9306 7.4342 24.8166 144.0575 6.3599 44.4804 150.4100 58.2556 4.5415 22.0403 26.4173 36.9549 31.9108 2.8219 9.0342 9.1189 3.9922 2.5739 12.0692 27.7844 24.5376 1.9094 109.9121 154.1630 36.4025 29.3260 8.4828 4.1723 197.2214 16.1044 22.7100 3.1584 85.7124 14.1420 4.4747 15.4069 42.5463 206.8353 192.7911 71.6292 417.0146 9.6825 589.7384 15.4177 44.0077 306.1814 44.6232 25.5553 24.3871 10.1570 26.7924 39.0444 11.8112 4.9900 10.7065 12.4343 43.9717 32.6136 18.1596 44.8585 9.2586 15.6245 3.9848 11.4728 8.3907 1.8065 15.2157 7.4757 60.3612 140.4232 56.1372 43.1840
temp: 298.150 k
press: 1.00000 atm
elementType: 17 8 8 7 7 7 7 7 6 6 6 6 6 6 6 6 6 6 6 6 6 6 6 6 6 6 6 6 6 6 6 1 1 1 1 1 1 1 1 1 1 1 1 1 1 1 1 1 1 1 1 1 1 1 1 1 1
symmnumber: 1
zpe: 1190944.7 jmol-1
zpe.correction: 0.453607 hartree
zpe.thermalcorrener: 0.484749 hartree
zpe.thermalcorrenthalpy: 0.485693 hartree
zpe.thermalcorrgfe: 0.386483 hartree
zpe.sumelectzpe: -1774.095921 hartree
zpe.sumelectthermal: -1774.064780 hartree
zpe.sumelectthermalent: -1774.063835 hartree
zpe.sumelectthermalfe: -1774.163045 hartree
dipole: 1.9338 -3.7495 0.1881
dipole: 4.2230
quadrupole: -157.8864 -188.5167 -182.1167
quadrupole: -5.4267 -3.5788 -13.9409
quadrupole: 18.2869 -12.3434 -5.9434 -5.4267 -3.5788 -13.9409
hfenergy: -1774.5495282 hartree
pointgroup: C01 [X(C23H26Cl1N5O2)]
dipole: 0.7059201 1.3105184 0.738039 debye
polarizability: 373.1576799|37.4311211|276.3584068|21.5824007|12.5381914|295.3475599 unknown
InChI: InChI=1S/C23H26ClN5O2/c1-4-29(5-2)22(30)17-8-6-7-15(11-17)13-31-19-10-9-16(12-18(19)24)20-14(3)27-23(26)28-21(20)25/h6-12H,4-5,13,25-26H2,1-3H3
charge 0 multiplicity 1
57 atoms
Cl -0.532707 0.191539 3.812826
O  0.883217 1.987288 1.93591
O  3.804752 -1.850145 -1.85414
N  4.552088 -1.762438 0.348143
N  -5.210239 -1.587036 -1.849411
N  -6.40903 -0.554355 0.016261
N  -5.322174 0.759884 1.59278
N  -7.521352 -1.843855 -1.587767
C  5.177792 -1.038449 1.481385
C  4.675011 -3.245573 0.341635
C  3.746742 0.316493 -0.800715
C  4.048219 -1.166394 -0.803204
C  2.558201 2.277475 0.089818
C  2.931341 0.917117 0.190458
C  1.711098 2.936238 1.17261
C  -2.710207 0.343698 0.311272
C  4.178348 1.088018 -1.908574
C  -3.973438 -0.251587 -0.210177
C  3.013501 3.044807 -1.009646
C  6.716812 -0.957962 1.361134
C  3.345224 -3.933139 0.713532
C  -0.272837 1.474668 1.336265
C  3.825036 2.450341 -2.003016
C  -2.259522 0.046884 1.630944
C  -1.908651 1.211857 -0.475233
C  -1.071232 0.605857 2.124334
C  -0.708874 1.764354 0.019631
C  -4.034496 -1.056887 -1.3827
C  -5.230437 -0.026007 0.461923
C  -2.810289 -1.411101 -2.200992
C  -6.340163 -1.308421 -1.123466
H  4.766476 -0.019676 1.534945
H  4.89425 -1.554117 2.418898
H  4.985518 -3.563359 -0.669229
H  5.471308 -3.524458 1.054741
H  2.54743 0.32211 1.026746
H  2.352959 3.378439 1.955137
H  1.080556 3.744574 0.750458
H  4.764782 0.603499 -2.695842
H  2.728378 4.100999 -1.097691
H  7.174792 -1.961467 1.299369
H  7.006084 -0.392539 0.457565
H  7.141299 -0.444213 2.243366
H  2.996131 -3.620486 1.714394
H  2.568105 -3.677276 -0.026191
H  3.469273 -5.031814 0.717559
H  4.164853 3.04473 -2.858048
H  -2.825931 -0.64661 2.260758
H  -2.230162 1.459598 -1.492142
H  -0.106391 2.404245 -0.630655
H  -2.698431 -0.716492 -3.055343
H  -1.882686 -1.369753 -1.608247
H  -2.939992 -2.421449 -2.621267
H  -6.243686 0.894553 2.002595
H  -4.509403 1.235004 1.975273
H  -8.383342 -1.664673 -1.081306
H  -7.50191 -2.414745 -2.427857
