program: Gaussian 09
title: 000290819
version: EM64L-G09RevD.01
frameworkgroup: C1[X(C12H15N5)]
method: RPBEPBE
basis: SDD
operation: Freq
keyword: #pfreq=noraman
keyword: PBEPBE/SDD
title: #p freq=noraman PBEPBE/SDD
converged: YES YES NO NO
title: Mulliken charges:
elementType: N N N N N C C C C C C C C C C C C H H H H H H H H H H H H H H H
charge: -0.093533 -0.114641 -0.637200 -0.535857 -0.594147 0.280981 0.048115 0.426879 0.098956 -0.381312 -0.433099 -0.378516 -0.387217 0.124606 -0.562906 -0.776702 -0.053135 0.239643 0.265225 0.229024 0.230672 0.219562 0.217550 0.232976 0.235135 0.247853 0.342302 0.322582 0.269631 0.267958 0.325787 0.322829
chargesum: 0.00000
title: Mulliken charges with hydrogens summed into heavy atoms:
elementType: N N N N N C C C C C C C C C C C C
charge: -0.093533 -0.114641 0.027684 0.001732 0.054468 0.280981 0.048115 0.426879 0.098956 -0.141669 -0.167874 -0.149492 -0.156545 0.124606 -0.125793 -0.060739 -0.053135
polarizability: 2.74095777e+02 -4.95764952e+00 1.52907709e+02 2.51885726e+00 8.89087327e+00 1.05585518e+02
1716.lowfreq: -13.9529 -5.0204 -2.5136 0.0002 0.0004 0.0005 24.7417 42.4936 49.1119
frequency: 24.6043 42.4114 48.8831 53.1970 86.6926 126.3298 139.9719 198.4389 212.1433 218.4407 224.6092 271.7857 307.3030 331.8856 341.5399 402.2359 404.1123 432.1010 437.0202 455.2587 503.9517 524.8006 528.0100 542.1931 548.5126 577.4479 588.8805 604.1902 635.9734 647.6324 688.7188 712.8999 747.3158 783.6897 799.8889 851.9954 854.2922 862.6250 910.7815 936.6816 961.4284 975.3638 989.1979 1015.0198 1040.6242 1062.3656 1066.7980 1074.3472 1090.3015 1133.4735 1136.4434 1188.0020 1203.6434 1274.0745 1299.3761 1300.7965 1325.0424 1330.0492 1359.5905 1375.7926 1392.9958 1405.0070 1429.9971 1454.3563 1455.8617 1468.3006 1476.7681 1503.8828 1518.5890 1558.4428 1565.9765 1597.3611 1611.8372 1615.8785 1647.5888 2988.3068 2995.2712 3053.9047 3075.7694 3107.0820 3108.8331 3117.0123 3135.7439 3143.3161 3439.8962 3543.4363 3564.1981 3565.4458 3698.2429 3725.2775
redmass: 2.6880 4.3612 3.6833 4.2533 1.0721 4.0346 3.7974 3.9054 6.6625 2.5276 1.9776 4.2409 2.6704 1.8942 2.9960 2.7319 3.5010 1.4708 2.2323 1.2997 3.0950 1.6479 1.8797 1.2122 4.0629 2.8175 3.3646 3.0560 6.6569 2.5747 3.2253 9.0427 4.5278 7.7445 3.6104 1.2468 1.8693 1.3022 3.6517 2.0981 1.3416 1.4005 3.7675 2.4985 1.5767 4.1901 2.4895 2.1326 1.4405 2.2797 1.1945 1.1625 2.9207 4.0877 1.9219 2.7008 1.5401 1.2396 2.4562 3.1845 1.4874 3.1388 3.3645 1.1081 1.1143 1.2372 2.6690 2.8306 4.4910 4.5799 6.1604 1.4656 2.2718 2.7425 1.0846 1.0403 1.0603 1.1043 1.0921 1.0878 1.0880 1.1009 1.0952 1.0960 1.0448 1.0442 1.0438 1.0969 1.1051 1.1059
irintensity: 1.4585 0.1011 0.8686 0.2365 0.1126 1.1981 1.2513 16.9672 4.9087 18.8567 16.9710 3.8737 7.6484 13.1803 8.4342 6.9048 1.3265 49.4336 203.6748 254.9845 4.1836 3.2405 4.5879 19.8749 30.8564 23.0394 27.0377 77.5545 3.7600 182.9541 122.2135 2.5610 3.7143 15.2893 58.9406 0.3182 53.8347 2.6840 1.0054 5.1175 0.4476 0.9560 14.2199 0.7634 5.5968 10.1872 4.0525 1.2228 3.2010 3.7586 6.2190 0.0771 9.8231 2.9319 18.2894 20.6051 1.9233 5.8009 3.1876 3.7659 25.7671 4.9283 75.4876 6.3419 18.7648 121.7600 56.4052 17.8850 234.3287 336.7649 46.6781 643.2147 175.1302 136.9123 28.9054 12.7662 54.9241 21.0932 14.8852 10.0364 28.3240 14.2674 22.9213 5.0080 5.1693 61.5547 130.5874 0.4217 53.4396 43.3324
temp: 298.150 k
press: 1.00000 atm
elementType: 7 7 7 7 7 6 6 6 6 6 6 6 6 6 6 6 6 1 1 1 1 1 1 1 1 1 1 1 1 1 1 1
symmnumber: 1
zpe: 680530.1 jmol-1
zpe.correction: 0.259200 hartree
zpe.thermalcorrener: 0.275836 hartree
zpe.thermalcorrenthalpy: 0.276780 hartree
zpe.thermalcorrgfe: 0.214064 hartree
zpe.sumelectzpe: -738.832253 hartree
zpe.sumelectthermal: -738.815618 hartree
zpe.sumelectthermalent: -738.814673 hartree
zpe.sumelectthermalfe: -738.877390 hartree
dipole: -0.0875 -1.0460 0.2093
dipole: 1.0704
quadrupole: -101.5367 -91.5372 -98.9617
quadrupole: 2.8679 0.0087 1.9319
quadrupole: -4.1915 5.8080 -1.6165 2.8679 0.0087 1.9319
hfenergy: -739.0914533 hartree
pointgroup: C01 [X(C12H15N5)]
dipole: -0.0387449 0.4179586 0.0338032 debye
polarizability: 273.987486|6.5595536|144.7363958|-0.0192242|20.1049249|113.8651216 unknown
InChI: InChI=1S/C12H15N5/c1-7-10(11(14)17-12(15)16-7)9-4-2-8(6-13)3-5-9/h2-5H,6,13-15H2,1H3
charge 0 multiplicity 1
32 atoms
N  -3.036788 -1.315916 -0.176264
N  -3.177748 1.093917 0.220314
N  -1.277206 2.423421 0.363379
N  5.590448 -0.830573 0.345827
N  -5.09862 -0.22917 0.039403
C  0.50874 0.122376 -0.007628
C  -0.978601 0.001323 0.004214
C  3.379134 0.371942 -0.026752
C  -1.667519 -1.228943 -0.184272
C  1.274267 -0.253742 -1.147199
C  1.212371 0.634406 1.120014
C  2.679233 -0.132571 -1.153977
C  2.618927 0.758542 1.106749
C  -1.813028 1.161977 0.2024
C  4.909228 0.4388 -0.015419
C  -0.94801 -2.545667 -0.392506
C  -3.723304 -0.145956 0.02685
H  0.753709 -0.62789 -2.036234
H  0.649742 0.914308 2.018739
H  3.241477 -0.422456 -2.051546
H  3.134641 1.155581 1.99104
H  5.281254 0.741147 -1.012086
H  5.244348 1.213675 0.69882
H  -0.850355 -2.769473 -1.472013
H  0.063533 -2.539623 0.044301
H  -1.545699 -3.356106 0.05514
H  -0.273659 2.578456 0.319269
H  -1.921787 3.203438 0.469047
H  5.445218 -1.579543 -0.34069
H  5.365145 -1.155519 1.292995
H  -5.534661 -1.136325 -0.097864
H  -5.64743 0.613066 0.184347
