program: Gaussian 09
title: 000290807
version: EM64L-G09RevD.01
frameworkgroup: C1[X(C6H13NO)]
method: RPBEPBE
basis: SDD
operation: Freq
keyword: #p
keyword: freq=noraman
keyword: PBEPBE/SDD
title: #p freq=noraman PBEPBE/SDD
converged: YES YES NO NO
title: Mulliken charges:
elementType: O N C C C C C C H H H H H H H H H H H H H
charge: -0.265233 -0.617348 -0.026700 -0.369136 -0.525967 -0.711398 -0.707468 0.234596 0.224262 0.230576 0.188700 0.239592 0.204720 0.215282 0.205832 0.205089 0.221874 0.210780 0.199471 0.311073 0.331403
chargesum: 0.00000
title: Mulliken charges with hydrogens summed into heavy atoms:
elementType: O N C C C C C C
charge: -0.265233 0.025128 0.197562 0.050140 -0.081655 -0.085195 -0.075343 0.234596
polarizability: 8.04152573e+01 5.09197266e+00 7.62189235e+01 -3.34495043e+00 1.01415470e+00 6.52601098e+01
1716.lowfreq: -16.8342 -0.0011 -0.0010 -0.0007 3.5867 20.2299 27.5778 35.8600 85.0829
frequency: 26.0863 32.1412 84.9793 177.3056 217.0259 237.4523 282.9129 343.5750 379.8590 402.4534 473.0905 491.3792 515.9769 603.4946 663.2657 762.2272 770.6529 894.0845 901.7310 911.5862 951.9594 975.8434 1045.6359 1047.9092 1119.3252 1129.0867 1173.7393 1198.9868 1238.1853 1283.2427 1308.6911 1333.3668 1352.4044 1369.0319 1374.1554 1391.1135 1445.5110 1451.9446 1466.6975 1471.5768 1480.2914 1487.4205 1594.7266 1642.6644 2964.7279 2968.1801 2969.6276 2980.2132 2987.8770 3033.2838 3050.2665 3055.8512 3065.2936 3066.6066 3072.7831 3514.6107 3672.3288
redmass: 3.2326 3.4453 3.4038 1.2758 1.1639 1.8692 2.2854 2.3602 2.0257 1.9768 2.0388 1.8599 1.4821 1.7880 1.8788 2.4540 2.6987 1.7085 1.9173 1.1933 1.3901 1.9000 1.8036 1.9559 1.8944 2.0284 1.7443 1.3628 1.4720 1.7495 1.2494 1.4902 1.5142 1.8531 1.3146 1.2178 1.0919 1.0932 1.0537 1.0514 1.0575 1.0495 1.4280 3.5656 1.0358 1.0370 1.0714 1.0704 1.0622 1.1004 1.1000 1.0989 1.0982 1.0989 1.0991 1.0446 1.1042
irintensity: 5.9318 7.4867 2.1203 1.6595 0.9869 3.1262 1.9607 1.6928 0.9494 1.7163 14.5073 32.0618 170.9081 56.0008 44.2975 6.5086 0.7755 10.9533 1.4902 3.5989 0.3896 7.1576 3.5772 2.8541 6.3830 3.0084 6.7348 12.7427 4.3497 65.2645 2.1005 15.8081 6.6129 51.1043 43.6824 11.6628 16.3653 15.3168 2.8288 13.2502 6.3220 18.9695 57.7903 263.9113 36.1282 23.9369 8.4512 33.9499 36.5436 9.3903 27.4976 10.7690 83.2493 58.7894 57.1911 25.7439 20.7100
temp: 298.150 k
press: 1.00000 atm
elementType: 8 7 6 6 6 6 6 6 1 1 1 1 1 1 1 1 1 1 1 1 1
symmnumber: 1
zpe: 483928.0 jmol-1
zpe.correction: 0.184318 hartree
zpe.thermalcorrener: 0.194416 hartree
zpe.thermalcorrenthalpy: 0.195360 hartree
zpe.thermalcorrgfe: 0.147828 hartree
zpe.sumelectzpe: -365.767995 hartree
zpe.sumelectthermal: -365.757898 hartree
zpe.sumelectthermalent: -365.756954 hartree
zpe.sumelectthermalfe: -365.804485 hartree
dipole: 0.5141 3.7174 0.7972
dipole: 3.8365
quadrupole: -46.4716 -52.9633 -49.2476
quadrupole: 8.8491 -0.7475 -1.9374
quadrupole: 3.0892 -3.4024 0.3132 8.8491 -0.7475 -1.9374
hfenergy: -365.9523136 hartree
pointgroup: C01 [X(C6H13N1O1)]
dipole: 0.2162201 -1.4644994 -0.2946044 debye
dipolederiv: -0.5914735 -0.046714 -0.1165531 0.1341501 -0.9638345 -0.0675812 -0.0882261 -0.2155662 -0.4800382 -0.8863402 0.3928599 0.0585276 0.276613 -0.6667675 0.2219275 -0.0345109 0.3306396 -0.5617281 0.0955549 0.0159396 -0.0014888 0.0476664 0.1391539 0.0084412 -0.0142433 0.0010859 0.1055073 0.1330781 0.0199495 0.0585515 -0.0301377 0.0190622 -0.0132801 0.0341105 0.0284832 0.1142514 -0.1524504 0.0197474 -0.1018929 0.0145193 0.082922 -0.0712387 -0.1733848 -0.1024691 -0.1312076 0.0491183 0.0018795 0.0374383 -0.0314411 -0.1044721 0.0151866 0.0556863 0.0258267 0.0693305 -0.0302214 0.0530966 0.033716 0.0490751 -0.0041343 0.0080362 0.0710556 -0.0061442 0.0889229 0.9242356 -0.3752963 0.3820591 -0.4173948 1.2971094 0.0170935 0.5091176 0.0506616 0.5572425 -0.0305217 -0.0192204 -0.1098225 -0.0171431 0.0091258 -0.0263906 -0.111065 -0.0201149 -0.0835077 0.0772347 -0.0256453 0.031564 -0.0062363 -0.1270932 0.038682 0.0449176 -0.0061371 0.0714634 -0.0747422 -0.0161196 -0.1286274 -0.0255456 0.0780246 -0.0571156 -0.0841062 -0.0216877 -0.1091873 -0.0170809 -0.0209696 0.0770267 -0.0501994 0.0718079 0.048224 0.0799066 0.0249772 -0.0752518 0.0446999 0.0126393 -0.0479275 0.0125864 -0.1787074 -0.0291264 -0.0510406 0.0254918 0.081954 -0.0064018 -0.0717419 0.1229789 -0.0425537 0.05848 0.0377381 0.1319057 0.0804049 -0.091663 -0.1044848 0.1609512 -0.0057895 0.1422127 -0.037519 -0.0156143 -0.0024913 -0.0267444 0.0898384 0.0060293 -0.0548823 -0.1064702 -0.0147798 0.0537046 -0.0097011 -0.1366809 -0.0770563 -0.0878592 0.0715852 -0.0639742 -0.0074424 -0.0148695 -0.1787033 -0.0112817 -0.006847 0.0067982 0.0970796 -0.0351698 -0.0041512 0.1128259 -0.034852 0.0759765 0.0716449 0.1526011 0.0361754 -0.1012348 -0.0195676 0.0061547 -0.0887526 -0.0343062 0.0711169 -0.0631302 -0.1589388 -0.0245589 -0.0872253 0.2971692 -0.0026418 -0.0938238 0.0089393 0.1300086 -0.0592529 -0.0916289 -0.0613752 0.2693925 0.249749 0.0181392 -0.1060974 0.0336973 0.1747389 -0.0432613 -0.1261371 -0.0486905 0.2639205 unknown
polarizability: 80.6970565|-4.9563799|76.1097921|3.0758149|0.9918282|65.0874419 unknown
InChI: InChI=1S/C6H13NO/c1-5(2)3-4-6(7)8/h5H,3-4,7H2,1-2H3
charge 0 multiplicity 1
21 atoms
O  1.740181 1.383251 0.386089
N  2.593211 -0.770692 0.419176
C  -1.452168 -0.045691 0.293857
C  -0.665181 0.378295 -0.97505
C  0.726759 -0.276859 -1.130334
C  -1.79488 -1.555179 0.302587
C  -2.742219 0.80002 0.415246
C  1.709102 0.193278 -0.046266
H  -0.815259 0.176604 1.175084
H  -0.515854 1.474435 -0.949085
H  -1.274621 0.147699 -1.872818
H  1.157654 0.024678 -2.106336
H  0.652945 -1.38084 -1.142946
H  -2.37051 -1.820689 1.208906
H  -0.890588 -2.191507 0.289015
H  -2.41195 -1.820815 -0.578208
H  -2.507873 1.88002 0.450973
H  -3.306741 0.543028 1.331029
H  -3.408813 0.624646 -0.452117
H  2.566425 -1.734137 0.09091
H  3.291876 -0.498548 1.110985
