program: Gaussian 09
title: 000290801
version: EM64L-G09RevD.01
frameworkgroup: C1[X(C17H23NO)]
method: RPBEPBE
basis: SDD
operation: Freq
keyword: #p
keyword: freq=noraman
keyword: PBEPBE/SDD
title: #p freq=noraman PBEPBE/SDD
converged: NO YES NO NO
title: Mulliken charges:
elementType: O N C C C C C C C C C C C C C C C C C H H H H H H H H H H H H H H H H H H H H H H H
charge: -0.251614 -0.616743 -0.143443 0.204235 0.242380 -0.473802 -0.462422 -0.534248 -0.452331 0.315811 -0.786202 -0.603490 0.284997 -0.788587 0.130553 -0.376362 -0.416788 -0.288545 -0.253766 0.168360 0.213538 0.209487 0.229920 0.188940 0.232525 0.227999 0.249891 0.195794 0.211321 0.212268 0.266568 0.226041 0.215687 0.204406 0.242131 0.228955 0.226753 0.231983 0.224032 0.330112 0.307686 0.225972
chargesum: 0.00000
title: Mulliken charges with hydrogens summed into heavy atoms:
elementType: O N C C C C C C C C C C C C C C C C C
charge: -0.251614 0.021055 0.024916 0.204235 0.242380 -0.050778 -0.043562 -0.073724 -0.006645 0.315811 -0.096046 -0.161762 0.284997 -0.113096 0.130553 -0.149609 -0.184805 -0.064513 -0.027793
polarizability: 2.23677698e+02 -1.01185558e+00 1.81465263e+02 -4.82192448e+00 1.52507960e+00 1.38555018e+02
1716.lowfreq: -28.5278 -6.0016 -0.0001 0.0004 0.0007 7.4024 60.0096 68.9312 79.4390
frequency: 59.4617 68.8964 79.3953 113.6083 142.4713 169.2589 196.0022 222.3829 244.1003 250.7910 268.4746 287.2205 298.8247 310.4631 319.2408 333.1090 349.6188 359.0213 387.2330 435.0773 448.7648 454.6295 480.8052 488.3259 498.8799 524.0816 543.9981 569.7350 574.7684 602.2652 621.2820 679.4519 702.7498 734.1727 741.9168 763.1155 777.0237 808.2327 822.6691 853.4344 867.9357 870.3078 903.0956 914.9958 948.5420 954.7893 972.2662 980.9287 984.7442 995.7225 1031.0883 1036.0347 1041.6331 1049.9071 1063.7106 1081.7574 1085.6196 1089.7101 1108.3833 1127.6763 1144.6441 1174.0614 1181.1166 1190.4603 1206.7649 1211.2849 1219.6975 1224.8550 1245.0289 1278.6355 1282.3054 1300.3679 1304.2515 1325.2360 1331.6733 1334.5167 1341.1731 1349.5937 1363.5306 1375.5299 1389.1886 1396.6705 1435.1116 1450.5717 1456.9447 1458.0458 1464.8357 1471.0278 1480.8395 1482.4062 1485.2885 1491.5317 1497.4076 1576.1408 1585.6612 1610.8419 1623.8433 2925.6864 2949.1905 2970.2380 2974.2017 2976.8338 2992.0069 2995.3583 2998.8792 3021.8822 3028.4876 3049.4241 3062.7293 3067.9047 3069.4354 3079.4134 3083.1441 3106.3067 3108.4388 3122.2730 3137.8184 3157.6936 3517.5918 3672.0151
redmass: 3.8600 4.4946 5.2019 2.9996 3.5807 2.7511 2.5290 1.5417 2.3334 2.3280 2.2945 2.5144 1.9992 1.9504 1.8248 3.6379 3.0615 2.4896 2.9678 3.2716 2.5441 2.6927 2.1220 1.5213 2.6183 2.9216 3.4856 1.5329 2.4729 2.8719 3.6406 2.8591 2.7221 3.0081 3.7922 1.5192 3.0599 3.4123 1.8192 1.7684 1.7871 1.4817 1.9319 2.2374 1.4131 2.0847 1.7651 1.6237 1.3341 2.1227 2.1501 2.5452 2.0903 1.8095 2.0709 2.5669 2.1918 1.6054 1.9306 2.0115 1.7568 1.1900 1.6082 1.9009 2.0546 2.0097 1.9411 1.6915 1.6996 1.4279 1.3610 1.4510 1.5902 2.2164 1.3641 1.5071 1.4864 1.4801 1.4579 6.0736 1.2146 1.1932 2.2182 1.0920 1.1413 1.1032 1.0800 1.0954 1.0875 1.3788 1.3903 1.0723 1.0819 2.0467 6.6648 6.2392 2.0909 1.0813 1.0656 1.0618 1.0467 1.0532 1.0413 1.0619 1.0663 1.0900 1.0983 1.0959 1.0995 1.0993 1.0985 1.0983 1.0988 1.0964 1.0872 1.0865 1.0929 1.1005 1.0445 1.1039
irintensity: 1.0919 3.3379 11.1087 0.8498 1.8034 1.2980 1.4476 0.2625 1.1123 1.0084 0.0714 0.0468 2.6630 1.3101 0.1884 3.7031 2.5922 1.2459 0.5226 3.5966 3.9682 2.0058 44.3571 138.2480 2.8245 1.3973 0.7958 70.4783 18.5559 7.9394 5.2594 2.4430 1.8163 19.6038 20.0580 53.7248 2.1048 4.1424 4.7172 1.7651 3.8134 0.0442 10.2315 0.6060 0.3063 6.8584 7.8012 5.1687 0.4945 2.5937 3.2564 10.7433 4.6060 4.9982 3.4396 3.1240 1.6190 5.2015 4.4045 1.4986 5.6757 0.1430 2.7788 1.5560 6.9465 4.5811 0.5992 9.1674 6.5413 4.4505 15.0435 19.0419 21.2347 43.3088 1.6797 4.1233 1.2759 1.6981 2.3544 1.8725 11.7374 19.0522 5.5037 13.1936 7.0411 3.0996 6.8276 19.1291 15.1131 16.8299 39.0977 4.1429 11.3873 84.6754 1.8771 0.8468 223.6689 40.2128 35.0814 30.0360 5.8658 44.7861 36.7718 25.4020 30.5630 43.8507 32.7177 23.2095 28.2403 39.7299 40.1131 31.4144 28.4502 24.5381 12.2920 2.4033 36.4843 35.9250 22.9969 24.4700
temp: 298.150 k
press: 1.00000 atm
elementType: 8 7 6 6 6 6 6 6 6 6 6 6 6 6 6 6 6 6 6 1 1 1 1 1 1 1 1 1 1 1 1 1 1 1 1 1 1 1 1 1 1 1
symmnumber: 1
zpe: 954032.9 jmol-1
zpe.correction: 0.363372 hartree
zpe.thermalcorrener: 0.380659 hartree
zpe.thermalcorrenthalpy: 0.381603 hartree
zpe.thermalcorrgfe: 0.320547 hartree
zpe.sumelectzpe: -790.180414 hartree
zpe.sumelectthermal: -790.163128 hartree
zpe.sumelectthermalent: -790.162183 hartree
zpe.sumelectthermalfe: -790.223239 hartree
dipole: -1.3194 2.9285 1.3025
dipole: 3.4661
quadrupole: -124.9251 -111.1329 -109.1051
quadrupole: 8.9907 3.7899 2.0647
quadrupole: -9.8708 3.9215 5.9493 8.9907 3.7899 2.0647
hfenergy: -790.5437861 hartree
pointgroup: C01 [X(C17H23N1O1)]
dipole: -0.5222752 1.1818633 0.4358897 debye
polarizability: 223.7547564|-1.3236916|181.4918243|-3.9827144|-1.1307621|138.4513976 unknown
InChI: InChI=1S/C17H23NO/c1-16-10-5-11-17(2,15(18)19)14(16)9-8-12-6-3-4-7-13(12)16/h3-4,6-7,14H,5,8-11,18H2,1-2H3
charge 0 multiplicity 1
42 atoms
O  3.80176 -1.170298 0.694259
N  2.930381 0.385554 2.150691
C  0.70164 0.725602 0.095521
C  -0.142473 -0.613467 0.048974
C  2.23666 0.528947 -0.252999
C  0.128323 -1.369038 -1.298053
C  2.40798 -0.280261 -1.569827
C  0.031302 1.818931 -0.776761
C  1.625135 -1.607823 -1.578138
C  -1.668746 -0.324317 0.120731
C  0.242694 -1.526652 1.253169
C  -1.3347 2.200478 -0.180554
C  -2.224889 0.983271 0.018531
C  2.969715 1.901336 -0.423924
C  3.029651 -0.182185 0.889156
C  -2.569587 -1.417723 0.25425
C  -3.631186 1.160607 0.083063
C  -3.96541 -1.236082 0.314888
C  -4.506505 0.067892 0.237046
H  0.637706 1.102735 1.14186
H  -0.312675 -0.786394 -2.132142
H  -0.415505 -2.333175 -1.27784
H  3.483523 -0.479664 -1.725798
H  2.060763 0.35424 -2.410995
H  -0.098139 1.463361 -1.816661
H  0.662487 2.723077 -0.818952
H  2.066468 -2.29555 -0.835264
H  1.738689 -2.09445 -2.566593
H  0.043136 -1.014095 2.212058
H  -0.343625 -2.461356 1.246649
H  1.304158 -1.817917 1.232802
H  -1.848903 2.934445 -0.83044
H  -1.172035 2.710362 0.793314
H  2.743606 2.609492 0.395391
H  4.063337 1.742763 -0.441294
H  2.690296 2.3789 -1.378732
H  -2.177046 -2.439091 0.310436
H  -4.038404 2.176711 0.000647
H  -4.625725 -2.104461 0.418898
H  3.476431 -0.027353 2.906412
H  2.321162 1.175107 2.352892
H  -5.58985 0.22564 0.28343
