program: Gaussian 09
title: 000027917
version: EM64L-G09RevD.01
frameworkgroup: C1[X(C13H18N2O)]
method: RPBEPBE
basis: SDD
operation: Freq
keyword: #p
keyword: freq=noraman
keyword: PBEPBE/SDD
title: #p freq=noraman PBEPBE/SDD
converged: YES YES NO NO
title: Mulliken charges:
elementType: O N N C C C C C C C C C C C C C H H H H H H H H H H H H H H H H H H
charge: -0.272024 -0.402076 -0.570809 -0.555685 0.398407 -0.377066 0.140252 -0.340831 0.211591 -0.449340 -0.572624 -0.396408 -0.324265 0.305977 -0.348545 -0.537278 0.206704 0.203222 0.205953 0.204527 0.217142 0.177712 0.267085 0.301041 0.245328 0.207883 0.178069 0.226974 0.246144 0.271790 0.257336 0.240959 0.217080 0.215774
chargesum: 0.00000
title: Mulliken charges with hydrogens summed into heavy atoms:
elementType: O N N C C C C C C C C C C C C C
charge: -0.272024 -0.101036 -0.041682 -0.145759 0.398407 0.033413 0.140252 0.054023 0.211591 -0.182255 -0.327296 -0.010456 -0.097292 0.305977 -0.102401 0.136536
polarizability: 1.90296472e+02 8.44742980e+00 1.89575585e+02 -1.64454703e+01 3.74621090e+00 9.89461284e+01
1716.lowfreq: -8.6440 -6.1247 -2.0084 -0.0008 -0.0004 -0.0004 21.1869 43.5783 49.0499
frequency: 20.6368 43.5023 48.9850 83.0826 89.8597 130.4115 143.2529 150.5254 167.8133 194.2212 239.3277 245.8669 260.6103 296.2425 345.5325 383.6730 393.2679 426.5194 462.4451 477.2468 489.4211 507.1543 573.3321 596.2188 608.0285 647.2453 690.2617 734.3847 747.1157 760.5919 786.0961 793.5133 803.5931 814.4872 842.8514 895.7092 908.1693 933.2190 961.3721 996.6481 1011.6476 1032.8528 1060.8293 1076.3189 1091.6023 1101.3566 1113.3939 1120.4117 1133.2699 1155.9065 1190.5003 1204.7662 1236.8303 1239.4295 1250.9593 1268.6531 1279.9961 1290.5931 1298.5390 1318.6171 1323.7056 1346.1492 1388.5876 1395.5274 1421.6792 1437.0676 1462.4915 1463.2660 1463.7312 1464.2390 1477.8449 1478.9930 1480.2102 1492.5522 1560.2641 1594.5626 1633.1631 1637.7527 2861.8554 2948.1775 2953.1368 2958.1805 2974.9050 3004.6225 3009.0755 3025.8459 3030.9360 3049.4569 3117.4608 3135.0131 3154.0449 3169.8691 3217.5696 3448.7970 3576.2804 3617.3366
redmass: 3.7214 2.2321 2.8373 3.1795 2.8579 1.9310 3.5027 4.0467 2.8853 3.3980 1.2098 1.2028 2.9339 4.3428 3.6311 4.7922 4.5071 2.8173 2.9814 2.3675 1.7721 3.7585 4.0610 2.6318 1.3212 3.6425 4.3362 1.2131 2.9715 3.1583 1.3128 1.6319 1.5401 3.8208 1.7359 1.5071 3.3701 1.3294 2.2685 4.4004 2.8848 2.5640 2.5985 2.2331 1.8860 1.5859 1.2629 1.7000 1.2464 1.3780 2.6583 1.5192 1.4502 1.8693 1.5640 1.4416 1.0860 1.1672 2.1939 1.7318 1.5693 1.5530 1.4621 5.1588 1.8521 1.5490 1.9601 1.0583 1.2481 1.1607 1.6253 1.9137 1.0989 1.0918 6.2925 6.4400 7.0830 1.0947 1.0715 1.0334 1.0644 1.0614 1.0604 1.0920 1.0896 1.0995 1.1033 1.1031 1.0986 1.0892 1.0909 1.0955 1.0982 1.0447 1.0974 1.0809
irintensity: 0.4371 1.7907 1.7561 9.6422 0.5838 1.4734 1.3107 0.1623 1.5803 9.1713 48.7998 1.4818 9.1528 3.2947 5.5989 2.5195 6.9876 5.6845 21.0410 35.1583 62.2846 8.0833 4.8641 22.9852 204.4852 10.8879 16.1936 8.8607 0.9748 5.0802 6.7478 50.9062 16.3948 11.0228 34.0143 1.2868 17.8288 0.0105 2.0373 39.9609 1.4459 11.7150 2.5484 4.0727 4.6671 54.6159 0.1916 11.8661 1.8049 0.3396 128.5516 23.6038 1.5402 13.2528 18.0186 4.8428 0.6126 5.1766 17.3909 7.9709 6.8624 0.7901 14.7702 23.3305 33.7203 10.2942 41.6320 11.5161 8.1607 8.6554 17.4023 78.3462 8.4717 8.1122 2.4665 23.4649 30.7427 40.0996 110.4323 57.4376 15.0203 32.7936 58.6811 17.5549 21.9373 1.9093 56.1398 112.2019 31.2727 13.7284 10.5190 9.5341 1.5695 2.1815 0.1649 62.2317
temp: 298.150 k
press: 1.00000 atm
elementType: 8 7 7 6 6 6 6 6 6 6 6 6 6 6 6 6 1 1 1 1 1 1 1 1 1 1 1 1 1 1 1 1 1 1
symmnumber: 1
zpe: 753308.0 jmol-1
zpe.correction: 0.286920 hartree
zpe.thermalcorrener: 0.303294 hartree
zpe.thermalcorrenthalpy: 0.304238 hartree
zpe.thermalcorrgfe: 0.241624 hartree
zpe.sumelectzpe: -689.691271 hartree
zpe.sumelectthermal: -689.674897 hartree
zpe.sumelectthermalent: -689.673952 hartree
zpe.sumelectthermalfe: -689.736567 hartree
dipole: -0.8220 -0.4701 -0.3626
dipole: 1.0139
quadrupole: -100.2512 -75.2628 -98.9639
quadrupole: -16.0665 1.0709 4.5592
quadrupole: -8.7586 16.2299 -7.4713 -16.0665 1.0709 4.5592
hfenergy: -689.9781905 hartree
pointgroup: C01 [X(C13H18N2O1)]
dipole: -0.3315795 -0.1747264 -0.136603 debye
polarizability: 191.0157629|7.8468507|189.0121627|-16.6389097|1.5316295|98.7902596 unknown
InChI: InChI=1S/C13H18N2O/c1-16-11-5-6-13-12(8-11)10(9-15-13)4-2-3-7-14/h5-6,8-9,15H,2-4,7,14H2,1H3
charge 0 multiplicity 1
34 atoms
O  2.780745 2.603007 -0.124586
N  1.408046 -2.814532 -0.112388
N  -5.984814 1.366857 -0.300589
C  -1.653547 -0.9271 0.972117
C  -0.29925 -1.427734 0.531494
C  -2.483746 -0.281464 -0.172966
C  0.867845 -0.619104 0.217242
C  -3.849782 0.250093 0.312517
C  1.920539 -1.512233 -0.182516
C  0.074567 -2.75692 0.319826
C  1.112794 0.783125 0.25209
C  -4.688643 0.878791 -0.818229
C  3.201931 -1.041942 -0.550461
C  2.393178 1.244614 -0.113417
C  3.428053 0.343245 -0.513732
C  1.776196 3.582949 0.279085
H  -2.239548 -1.760825 1.40639
H  -1.53243 -0.178934 1.783328
H  -2.636082 -1.034748 -0.971755
H  -1.89871 0.541003 -0.631828
H  -4.440899 -0.566981 0.770186
H  -3.687149 1.006693 1.110876
H  -0.514146 -3.663935 0.448198
H  1.923554 -3.664472 -0.326668
H  0.320779 1.471327 0.561745
H  -4.897009 0.104593 -1.582106
H  -4.075057 1.667686 -1.321785
H  4.002681 -1.724765 -0.855284
H  4.39889 0.767205 -0.787043
H  -6.652896 1.646652 -1.025643
H  -5.892081 2.084232 0.426592
H  2.274812 4.560667 0.200864
H  1.444424 3.416591 1.32372
H  0.894455 3.559659 -0.392575
