program: Gaussian 09
title: 000290790
version: EM64L-G09RevD.01
frameworkgroup: C1[X(C16H16O2)]
method: RPBEPBE
basis: SDD
operation: Freq
keyword: #pfreq=noraman
keyword: PBEPBE/SDD
title: #p freq=noraman PBEPBE/SDD
converged: YES YES NO NO
title: Mulliken charges:
elementType: O O C C C C C C C C C C C C C C C C H H H H H H H H H H H H H H H H
charge: -0.309049 -0.469055 -0.115488 -0.276551 -0.377478 -0.299039 0.510144 0.465445 -0.439225 -0.387097 -0.423178 -0.358964 -0.219594 -0.241487 -0.244045 -0.233437 -0.227288 -0.242766 0.285239 0.217288 0.222304 0.222190 0.251494 0.221836 0.265566 0.369152 0.224812 0.264120 0.223621 0.223888 0.227065 0.222095 0.222360 0.225121
chargesum: 0.00000
title: Mulliken charges with hydrogens summed into heavy atoms:
elementType: O O C C C C C C C C C C C C C C C C
charge: -0.309049 -0.099904 0.169751 -0.059263 0.067016 -0.047545 0.510144 0.465445 -0.217389 -0.121531 -0.198365 -0.094844 0.004027 -0.017599 -0.016980 -0.011342 -0.004929 -0.017645
polarizability: 1.68430146e+02 2.06845403e+01 1.66472179e+02 -5.38223397e+00 1.19905280e+01 1.60011924e+02
1716.lowfreq: -11.1067 -3.1995 -0.0008 -0.0003 0.0001 7.3832 19.4543 31.6165 43.7432
frequency: 18.8393 31.4968 43.6658 48.2251 73.1568 102.9599 140.4462 169.9602 212.3325 226.2296 269.8348 284.8829 326.8429 357.3856 365.8356 400.7800 403.7413 405.5755 503.0829 509.4808 564.6231 608.7395 616.1675 618.5144 688.9650 704.9043 706.5749 722.8411 753.0324 772.2821 783.6442 808.0912 847.0197 851.5737 856.8694 897.9779 916.1542 929.8399 936.9287 974.9122 977.0361 989.3460 990.5795 995.6851 995.7491 1005.5584 1025.7209 1027.6522 1033.9420 1071.2799 1084.9809 1096.4488 1107.8998 1141.5809 1170.2589 1171.4611 1173.0992 1187.0598 1190.0268 1195.8290 1210.4255 1232.9653 1246.0016 1263.0065 1318.6307 1323.3384 1339.3303 1380.0714 1381.8056 1385.8928 1404.6355 1439.3449 1441.8836 1480.4807 1482.7374 1485.0921 1591.0770 1595.0386 1613.8665 1617.1740 2982.5002 2999.9736 3064.3249 3104.4847 3106.2788 3114.1123 3123.4358 3124.7073 3136.6317 3138.3682 3147.8441 3157.0121 3162.1097 3171.3954 3176.1746 3580.8554
redmass: 4.0359 5.0451 3.9551 4.5226 4.1755 4.3929 5.7777 4.4953 4.6139 4.5579 5.7221 4.8325 1.3089 4.5065 2.3937 3.0750 3.8001 2.8668 3.7855 3.3016 5.0534 5.4546 6.4232 6.0521 4.7320 1.6378 1.7709 4.7335 2.5666 2.6797 2.5317 3.0029 3.5837 1.2529 1.2503 1.7578 1.5765 1.5792 2.4909 1.3845 1.4118 3.1571 5.9353 1.6641 1.3373 2.2549 1.8678 2.0520 1.9070 1.8898 1.6579 1.7624 1.2735 1.5932 1.2565 1.0590 1.2378 1.1934 1.1266 1.9212 1.2514 1.6163 1.3920 1.3681 1.4337 1.2823 1.4364 3.3388 4.4760 3.4857 1.5419 2.1391 2.1536 1.2112 2.2622 2.3911 6.0276 6.1939 6.1494 6.1087 1.0840 1.0846 1.0532 1.0904 1.0878 1.0869 1.0865 1.0865 1.0920 1.0929 1.0956 1.0985 1.1015 1.1187 1.0959 1.0665
irintensity: 0.3974 1.1368 1.5778 3.7403 0.6407 5.0214 3.0559 5.2407 2.4135 3.9729 4.4422 20.0803 120.1529 11.6981 22.2123 4.9983 4.4541 0.0901 8.4196 11.5166 22.4937 6.9863 0.2341 2.6352 21.8882 90.8937 61.0811 41.1469 4.8202 25.2330 10.7190 21.4663 12.9284 0.1547 1.2746 0.9218 2.0445 10.5232 10.5547 0.4197 1.3875 1.5531 0.0834 1.2434 2.2861 35.9157 5.6981 5.5391 21.7820 12.0719 5.0774 18.0689 6.8422 3.8429 23.1439 0.0834 21.5676 6.3452 0.0385 1.2303 1.3523 8.8190 5.4770 7.0377 5.9452 7.0272 2.5012 5.4241 5.2883 3.8787 8.8370 6.7973 12.5616 5.8688 16.2330 12.4600 1.3988 0.7320 4.9870 5.1625 10.9005 23.3954 30.2879 10.0340 10.7682 8.1954 0.6739 1.4476 17.7063 36.4512 21.7823 33.3760 23.6728 27.1057 5.3529 16.5510
temp: 298.150 k
press: 1.00000 atm
elementType: 8 8 6 6 6 6 6 6 6 6 6 6 6 6 6 6 6 6 1 1 1 1 1 1 1 1 1 1 1 1 1 1 1 1
symmnumber: 1
zpe: 721399.7 jmol-1
zpe.correction: 0.274767 hartree
zpe.thermalcorrener: 0.290824 hartree
zpe.thermalcorrenthalpy: 0.291769 hartree
zpe.thermalcorrgfe: 0.228977 hartree
zpe.sumelectzpe: -768.399305 hartree
zpe.sumelectthermal: -768.383247 hartree
zpe.sumelectthermalent: -768.382303 hartree
zpe.sumelectthermalfe: -768.445094 hartree
dipole: -1.2617 1.1746 -1.4958
dipole: 2.2824
quadrupole: -99.9504 -107.5557 -96.6238
quadrupole: 1.2619 -1.0134 3.6764
quadrupole: 1.4262 -6.1791 4.7528 1.2619 -1.0134 3.6764
hfenergy: -768.6740712 hartree
pointgroup: C01 [X(C16H16O2)]
dipole: 0.5067996 -0.2881979 -0.6829389 debye
polarizability: 162.2597101|17.354054|176.8242827|9.2089795|-10.8777962|155.8302562 unknown
InChI: InChI=1S/C16H16O2/c17-16(13-9-5-2-6-10-13)15(14-11-18-14)12-7-3-1-4-8-12/h1-10,14-17H,11H2
charge 0 multiplicity 1
34 atoms
O  2.285569 3.106809 0.047111
O  0.29998 1.378562 2.016865
C  2.303983 1.584474 -0.010913
C  0.971779 0.923784 -0.362833
C  3.10492 2.37481 -0.993578
C  -0.130931 1.491419 0.610806
C  1.122351 -0.59499 -0.366738
C  -1.475018 0.801601 0.43798
C  0.958445 -1.322142 -1.572461
C  1.452645 -1.307514 0.817608
C  -2.251428 1.078004 -0.715431
C  -1.961667 -0.122275 1.392327
C  1.119628 -2.725652 -1.602419
C  1.611821 -2.710376 0.789929
C  1.450871 -3.425277 -0.419771
C  -3.492244 0.434606 -0.917703
C  -3.204178 -0.764987 1.191766
C  -3.972226 -0.492924 0.036411
H  2.83926 1.134094 0.834723
H  0.673552 1.250835 -1.378488
H  4.190812 2.463605 -0.866579
H  2.734356 2.483569 -2.020823
H  -0.228238 2.565226 0.350295
H  0.693747 -0.786402 -2.492788
H  1.547165 -0.761434 1.762501
H  0.881451 2.153414 2.219743
H  -1.894766 1.808763 -1.453507
H  -1.368799 -0.313889 2.290905
H  0.984792 -3.270669 -2.543624
H  1.858194 -3.247002 1.713421
H  1.576615 -4.513734 -0.439581
H  -4.08614 0.660936 -1.810643
H  -3.573204 -1.477686 1.938249
H  -4.936094 -0.991563 -0.116566
