program: Gaussian 09
title: 000027921
version: EM64L-G09RevD.01
frameworkgroup: C1[X(C19H23NO2)]
method: RPBEPBE
basis: SDD
operation: Freq
keyword: #p
keyword: freq=noraman
keyword: PBEPBE/SDD
title: #p freq=noraman PBEPBE/SDD
converged: YES YES NO NO
title: Mulliken charges:
elementType: O O N C C C C C C C C C C C C C C C C C C C H H H H H H H H H H H H H H H H H H H H H H H
charge: -0.302872 -0.300956 -0.091482 -0.201408 0.354678 -0.481292 -0.561020 0.348949 -0.640424 -0.567375 -0.642293 -0.543010 0.504137 0.189689 0.192516 -0.354683 -0.454174 -0.237129 -0.224802 -0.247628 -0.530613 -0.531259 0.229594 0.223962 0.223167 0.223485 0.232754 0.227767 0.231062 0.259326 0.220805 0.233976 0.204728 0.256123 0.257378 0.226816 0.220661 0.220849 0.224083 0.228320 0.220985 0.253212 0.220961 0.254272 0.228164
chargesum: 0.00000
title: Mulliken charges with hydrogens summed into heavy atoms:
elementType: O O N C C C C C C C C C C C C C C C C C C C
charge: -0.302872 -0.300956 -0.091482 0.028186 0.354678 -0.034163 -0.104781 0.348949 -0.181595 -0.308048 0.017215 -0.286888 0.504137 0.189689 0.192516 -0.097305 -0.227358 -0.016468 -0.003953 -0.023545 0.171904 0.172138
polarizability: 2.96986840e+02 5.40516745e+00 2.28809670e+02 1.10343431e+01 -1.25804914e+01 1.31460396e+02
1716.lowfreq: -0.0008 -0.0006 -0.0005 2.9528 8.0838 10.4109 20.6775 30.3771 42.3645
frequency: 20.5638 30.3082 42.2925 58.9796 76.1076 83.0261 106.8967 123.2335 138.2370 155.0373 163.7736 169.4570 196.6114 213.6428 221.6576 237.8759 260.1104 283.3214 288.4806 325.9744 338.2045 393.6880 396.1186 405.3632 425.2691 447.0729 459.0419 489.8035 505.3803 523.6890 555.4159 604.7538 618.0737 633.3902 657.4886 702.6884 707.5401 714.8358 737.8441 754.9410 761.6216 775.8591 840.8264 848.9685 863.5424 888.6935 900.7664 903.1796 918.7227 949.0727 956.3552 965.7786 971.4473 989.0576 991.2550 1005.5347 1026.0262 1028.1270 1048.7087 1070.2152 1083.1318 1114.8646 1115.4681 1116.1758 1123.9205 1147.4513 1150.8138 1156.3593 1162.8902 1170.0111 1175.7908 1186.7098 1198.3746 1213.5269 1214.3663 1237.9011 1262.9719 1266.1742 1281.7016 1305.6645 1317.1739 1330.4629 1346.3984 1360.8253 1373.0408 1382.1993 1387.8559 1424.8137 1434.6469 1438.5379 1443.6317 1452.4124 1457.4226 1458.7959 1460.1839 1467.9557 1472.5817 1478.3809 1482.4786 1485.1632 1488.9912 1490.8057 1566.0284 1590.5799 1612.5990 1614.7417 2885.7982 2965.8585 2968.6947 2970.6844 2985.6678 2988.3264 2998.4711 3017.7681 3022.2297 3049.4546 3051.8059 3064.6888 3066.4349 3074.9387 3109.0509 3118.8276 3118.9961 3120.6378 3128.9591 3134.8252 3136.7316 3151.6438 3163.3104
redmass: 4.1764 4.0930 4.0841 3.4801 3.3564 3.5280 2.8828 3.6790 3.3926 1.1857 2.2175 1.1983 1.9901 3.0076 1.6312 3.0548 4.3032 4.8627 3.4498 3.8635 2.4210 4.1842 3.0408 2.8062 3.7934 3.3724 2.5583 3.8102 4.4492 4.1590 3.3611 4.4768 6.1363 4.1743 4.4787 1.7349 4.3450 5.8407 3.3397 2.2438 2.2751 4.4632 2.9676 1.2610 2.1184 1.6197 1.9222 1.9070 1.7981 3.5391 4.6802 2.1416 1.4809 1.9885 2.4212 2.6871 2.3702 2.2019 2.5145 3.3000 1.7865 1.2839 1.8337 1.2418 1.4385 1.4452 1.5289 1.2936 1.4725 1.0554 2.9945 1.1162 1.3617 1.6586 2.5666 1.3815 1.3672 3.5142 1.9960 1.4199 1.4738 1.2774 1.3494 2.5741 2.2991 6.6529 2.8000 1.1761 1.1714 2.0995 1.3120 1.1103 1.0555 1.0665 1.0902 1.0724 1.1195 1.0560 2.2530 2.6720 1.0543 1.0985 8.0950 6.0132 6.1613 7.1454 1.0533 1.0624 1.0310 1.0314 1.0648 1.0678 1.0743 1.0772 1.0947 1.1032 1.1011 1.1037 1.1036 1.1008 1.0868 1.1027 1.1026 1.0864 1.0908 1.0927 1.0916 1.0960 1.0994
irintensity: 0.0042 0.1210 0.4528 0.5484 0.9034 3.0019 6.5877 1.5173 4.3777 0.2924 2.5071 0.6313 0.8523 5.4902 0.9929 1.0181 2.0039 8.1792 4.7051 1.4036 1.2231 1.1684 3.3427 0.0771 4.6419 1.3574 4.7478 2.6879 13.5850 15.5515 15.7951 0.4761 0.4284 28.5768 9.4802 53.6972 9.4197 13.1114 6.1649 18.0862 23.5389 1.2893 2.8755 0.3760 1.2423 2.7190 4.1327 45.9265 10.8544 14.0926 77.4866 10.3765 0.5557 0.4697 0.2307 1.4161 14.6811 13.1572 29.2009 70.1689 19.1865 19.5489 16.9861 2.8970 0.2470 6.4100 5.7442 8.0378 9.2725 0.0874 35.2965 1.0424 18.9948 9.3404 1.4166 3.7922 8.5723 144.4735 13.5534 4.6127 8.6159 4.3112 1.9940 5.7258 15.3984 1.3380 7.6519 0.5152 12.3697 7.3009 9.1805 13.1587 14.4322 3.9344 13.8432 5.6177 11.3153 5.3365 41.8198 131.8250 27.5306 26.6620 1.1704 1.3061 12.7849 2.6463 105.6226 32.9878 96.5589 61.7373 30.3313 13.4762 38.6627 46.2475 38.4108 51.7073 9.2541 32.0828 23.2899 29.3619 11.4520 22.5444 30.2352 0.6652 9.0779 33.9536 5.0038 37.8400 16.7937
temp: 298.150 k
press: 1.00000 atm
elementType: 8 8 7 6 6 6 6 6 6 6 6 6 6 6 6 6 6 6 6 6 6 6 1 1 1 1 1 1 1 1 1 1 1 1 1 1 1 1 1 1 1 1 1 1 1
symmnumber: 1
zpe: 985523.9 jmol-1
zpe.correction: 0.375366 hartree
zpe.thermalcorrener: 0.396589 hartree
zpe.thermalcorrenthalpy: 0.397533 hartree
zpe.thermalcorrgfe: 0.324270 hartree
zpe.sumelectzpe: -941.344597 hartree
zpe.sumelectthermal: -941.323374 hartree
zpe.sumelectthermalent: -941.322430 hartree
zpe.sumelectthermalfe: -941.395693 hartree
dipole: -1.3653 0.8383 0.3548
dipole: 1.6409
quadrupole: -125.5232 -117.9838 -133.4425
quadrupole: 4.4790 -0.0098 1.6053
quadrupole: 0.1266 7.6661 -7.7927 4.4790 -0.0098 1.6053
hfenergy: -941.7199628 hartree
pointgroup: C01 [X(C19H23N1O2)]
dipole: 0.5522825 0.3098087 -0.125633 debye
polarizability: 296.0427014|-8.6259837|228.897145|13.8620075|13.7704858|132.3170593 unknown
InChI: InChI=1S/C19H23NO2/c1-20-10-9-15-12-18(21-2)19(22-3)13-16(15)17(20)11-14-7-5-4-6-8-14/h4-8,12-13,17H,9-11H2,1-3H3
charge 0 multiplicity 1
45 atoms
O  3.262254 -2.331469 -0.521044
O  4.920629 -0.092975 0.407844
N  -1.273116 1.935196 -0.287237
C  -0.812097 0.521066 -0.290373
C  0.711482 0.375367 -0.099257
C  -0.639006 2.725841 0.794629
C  0.90026 2.823576 0.645607
C  1.514352 1.457006 0.36133
C  -1.601934 -0.325056 0.771695
C  1.328868 -0.870629 -0.371649
C  -1.220826 2.583949 -1.614744
C  2.910456 1.264244 0.510119
C  -3.042206 -0.601472 0.370194
C  2.712424 -1.063609 -0.20521
C  3.521767 0.030728 0.218848
C  -4.018742 0.430046 0.370316
C  -3.436624 -1.903526 -0.034918
C  -5.348894 0.165373 -0.025702
C  -4.766991 -2.172265 -0.43161
C  -5.729583 -1.136688 -0.427797
C  3.881166 -3.032175 0.628156
C  5.681415 -0.392553 -0.827785
H  -1.072176 0.099914 -1.28151
H  -0.883229 2.247372 1.762363
H  -1.091848 3.73452 0.805609
H  1.344881 3.260645 1.560633
H  1.14789 3.518084 -0.183329
H  -1.557953 0.209689 1.740064
H  -1.068875 -1.282309 0.916161
H  0.737627 -1.724913 -0.722913
H  -1.619923 3.611509 -1.531804
H  -1.865054 2.026163 -2.317449
H  -0.199634 2.64569 -2.061931
H  3.552706 2.086021 0.847673
H  -3.712735 1.440885 0.658344
H  -2.696209 -2.714123 -0.034834
H  -6.089892 0.973451 -0.01878
H  -5.052136 -3.185409 -0.738251
H  -6.762653 -1.342158 -0.731134
H  4.29131 -3.966813 0.215841
H  3.113458 -3.2624 1.39148
H  4.683894 -2.420858 1.078786
H  5.600227 0.452617 -1.537818
H  5.312495 -1.318332 -1.305131
H  6.727475 -0.512319 -0.506581
