program: Gaussian 09
title: 000290787
version: EM64L-G09RevD.01
frameworkgroup: C1[X(C11H7NS2)]
method: RPBEPBE
basis: SDD
operation: Freq
keyword: #p
keyword: freq=noraman
keyword: PBEPBE/SDD
title: #p freq=noraman PBEPBE/SDD
converged: NO NO NO NO
title: Mulliken charges:
elementType: S S N C C C C C C C C C C C H H H H H H H
charge: 0.237372 0.317332 -0.038858 -0.332167 0.325899 -0.150218 -0.088696 -0.277867 -0.345312 -0.288238 -0.237338 -0.213355 -0.137012 -0.517392 0.246116 0.261193 0.256399 0.231174 0.232571 0.249583 0.268815
chargesum: 0.00000
title: Mulliken charges with hydrogens summed into heavy atoms:
elementType: S S N C C C C C C C C C C C
charge: 0.237372 0.317332 -0.038858 -0.332167 0.325899 -0.150218 -0.088696 -0.031751 -0.084119 -0.031839 -0.006164 0.019215 0.112571 -0.248577
polarizability: 3.10292892e+02 -1.00638665e+01 1.58299614e+02 8.11078894e-03 6.55581811e-03 5.65490882e+01
1716.lowfreq: -0.0031 -0.0030 -0.0008 4.4013 9.0991 12.5199 45.4999 68.2666 91.1629
frequency: 45.4975 68.2607 91.1625 172.9298 193.1099 240.8845 296.7938 308.6787 384.9433 429.9924 461.8488 486.6048 542.6623 547.3812 571.2207 614.9355 618.3138 649.9398 679.7530 687.6675 707.3268 731.4796 766.4302 777.9873 829.7052 834.4485 862.6823 863.8723 914.9771 947.1279 985.2752 1014.8555 1034.8241 1060.3975 1087.5614 1117.5281 1169.2647 1185.4507 1216.1648 1252.1434 1283.4020 1340.7790 1374.9364 1431.2542 1442.6407 1459.6429 1489.2882 1560.0633 1572.0072 1611.9614 3136.5798 3150.3524 3164.6593 3167.1928 3175.6891 3187.9419 3233.9794
redmass: 6.3948 5.7123 6.5239 5.4729 5.6119 11.3795 6.3636 5.8731 9.9614 3.2985 5.1008 9.0661 3.8626 10.0755 3.4210 9.1572 6.9948 9.8268 7.2346 7.0070 1.1692 2.6352 1.5461 6.7656 5.3872 1.3249 7.5333 1.3878 1.3759 1.3824 1.3196 2.4106 3.8308 1.7343 1.1426 1.5585 1.1895 3.8607 1.6942 1.7509 2.0040 2.5207 4.4253 3.0138 2.7193 6.5540 6.0035 6.5282 7.1140 7.8941 1.0857 1.0904 1.0957 1.0911 1.0997 1.0964 1.1002
irintensity: 0.1937 2.8890 0.6887 0.4232 1.0059 1.9537 1.1154 0.0362 0.3115 3.6764 8.6824 0.9466 0.3245 0.9628 2.6386 14.0715 1.2648 19.9653 2.1750 3.9021 107.1838 17.4249 85.8756 53.0364 5.0822 15.2137 26.2469 0.9927 0.3123 2.8656 0.0525 11.9271 6.6717 15.8402 5.2286 7.5973 0.0198 13.3550 14.9193 6.0123 2.0327 1.3540 11.2367 17.0335 18.9600 24.3009 56.7047 25.1218 10.6774 25.3684 1.8748 8.6414 17.7619 7.4413 21.0820 5.0318 0.3401
temp: 298.150 k
press: 1.00000 atm
elementType: 16 16 7 6 6 6 6 6 6 6 6 6 6 6 1 1 1 1 1 1 1
symmnumber: 1
zpe: 384207.3 jmol-1
zpe.correction: 0.146337 hartree
zpe.thermalcorrener: 0.157461 hartree
zpe.thermalcorrenthalpy: 0.158405 hartree
zpe.thermalcorrgfe: 0.108108 hartree
zpe.sumelectzpe: -1273.286891 hartree
zpe.sumelectthermal: -1273.275767 hartree
zpe.sumelectthermalent: -1273.274823 hartree
zpe.sumelectthermalfe: -1273.325120 hartree
dipole: -0.2197 1.2635 0.0002
dipole: 1.2825
quadrupole: -70.1117 -89.3117 -101.6784
quadrupole: -1.8919 -0.0002 0.0023
quadrupole: 16.9222 -2.2778 -14.6445 -1.8919 -0.0002 0.0023
hfenergy: -1273.4332277 hartree
pointgroup: C01 [X(C11H7N1S2)]
dipole: -0.1170266 0.4908139 0.0000844 debye
dipolederiv: -0.3720357 -0.0649797 -0.0000126 -0.2064768 -0.4250008 0.0000943 0.0000057 0.000058 0.0700535 0.1474479 0.1234504 0.0000922 0.0431996 -0.1854981 -0.0001926 -0.0001103 -0.0002249 0.168466 -0.5750256 0.2058115 -0.0000813 0.2124004 -0.6690549 0.0001204 -0.0000996 0.0000648 -0.1846453 0.2058963 -0.2233197 0.0000815 -0.2566268 -0.032097 -0.0000199 0.0000287 -0.0000007 -0.0796893 0.2525093 -0.1066272 0.0000148 0.0758147 0.0084311 0.0000215 0.0000912 0.0000084 0.0759248 1.0172851 0.171779 0.0000241 0.2720881 0.8732062 -0.0002867 -0.0000702 -0.000161 0.0182734 -0.4402613 0.0652044 0.0000677 0.2246837 0.2684932 0.0003378 0.0002961 0.0002404 -0.1510727 -0.0426305 0.1116792 -0.0000225 0.1735179 0.0800035 -0.0000204 -0.0000621 -0.0000339 -0.1251464 0.1134866 0.05223 0.0000068 -0.0371974 0.0878521 -0.0000451 0.000022 -0.0000351 -0.1500517 0.2670675 0.1525209 0.0001166 -0.0234211 -0.136373 0.0000139 -0.0000403 0.0000183 -0.1386767 -0.0880522 0.0322987 -0.0000011 0.1261669 0.0671629 -0.0000391 -0.0000035 -0.0000415 -0.164725 -0.089988 -0.1250539 0.0000212 -0.2837786 -0.016703 -0.0000357 0.0000321 -0.0000299 -0.1650763 -0.1531774 -0.1283837 -0.0000883 -0.3978793 -0.1949706 -0.0000781 -0.0002532 -0.0000084 -0.1418764 -0.3410187 -0.2262417 -0.0002306 0.0681386 0.2033343 0.0002719 0.0000769 0.000267 -0.305518 0.0788631 0.0037821 -0.0000044 -0.0624269 -0.0585533 0.0000341 0.0000012 0.0000373 0.1671804 0.0884546 -0.048286 0.0000025 -0.0009725 -0.0424588 0.0000393 0.0000062 0.0000298 0.16983 0.1262824 -0.0591972 -0.0000221 -0.0799992 -0.0156428 -0.000118 -0.0000143 -0.0000949 0.1943997 -0.1197699 -0.0638676 -0.0000022 -0.0612339 0.0660051 0.0000151 0.0000061 0.0000147 0.165213 -0.0662324 0.1020784 -0.0000274 0.1166966 0.0077558 0.0000317 -0.0000306 0.0000309 0.1636648 -0.0231898 0.0686614 0.0000571 0.1159876 0.0380031 -0.00008 0.0000792 -0.0000794 0.1957905 0.0140887 -0.0435394 0.0000083 -0.0186816 0.0761051 -0.0000645 0.0000387 -0.0000602 0.2176818 unknown
polarizability: 310.9539685|-0.6042851|157.6385371|0.0076898|0.0070449|56.5490882 unknown
InChI: InChI=1S/C11H7NS2/c1-2-5-9-8(4-1)12-11(14-9)10-6-3-7-13-10/h1-7H
charge 0 multiplicity 1
21 atoms
S  0.232035 1.773008 -0.000632
S  -2.904648 -1.554288 -0.001292
N  0.173763 -0.93358 -0.000135
C  1.787981 0.845513 -0.000385
C  1.529176 -0.568065 -0.00015
C  -0.63517 0.114581 -0.000341
C  -2.076353 0.058399 -0.000416
C  3.101199 1.352584 -0.000415
C  2.614457 -1.477659 0.000051
C  -3.007792 1.099337 0.000041
C  4.170996 0.428265 -0.000213
C  3.928793 -0.972714 0.000016
C  -4.372251 0.65283 -0.000084
C  -4.494168 -0.731259 -0.000585
H  3.29742 2.429084 -0.000583
H  2.407653 -2.551789 0.000229
H  -2.718192 2.153994 0.000585
H  5.200714 0.801548 -0.000231
H  4.776017 -1.66658 0.000169
H  -5.230439 1.328602 0.000304
H  -5.401392 -1.333711 -0.000735
