program: Gaussian 09
title: 000290770
version: EM64L-G09RevD.01
frameworkgroup: C1[X(C11H10N2O5)]
method: RPBEPBE
basis: SDD
operation: Freq
keyword: #p
keyword: freq=noraman
keyword: PBEPBE/SDD
title: #p freq=noraman PBEPBE/SDD
converged: YES YES NO NO
title: Mulliken charges:
elementType: O O O O O N N C C C C C C C C C C C H H H H H H H H H H
charge: -0.264308 -0.187488 -0.195577 -0.417375 -0.227555 -0.233599 -0.233418 0.180749 0.184823 0.109364 0.110490 -0.230178 -0.350192 -0.350594 -0.209716 -0.209768 -0.439097 0.240051 0.238715 0.272154 0.270229 0.269856 0.239341 0.239182 0.300979 0.248429 0.261042 0.383462
chargesum: 0.00000
title: Mulliken charges with hydrogens summed into heavy atoms:
elementType: O O O O O N N C C C C C C C C C C C
charge: -0.264308 -0.187488 -0.195577 -0.033913 -0.227555 -0.233599 0.067561 0.180749 0.184823 0.109364 0.110490 0.280691 -0.079963 -0.080738 0.029626 0.029413 0.070374 0.240051
polarizability: 2.09271365e+02 7.48674783e-01 1.58391713e+02 6.44212748e+00 6.84272629e-01 8.46180487e+01
1716.lowfreq: -3.3522 -0.0012 -0.0008 -0.0005 2.6254 5.0082 7.8962 27.1992 45.8143
frequency: 7.6910 27.0109 45.8072 55.6352 89.4784 122.6604 136.4593 141.8116 178.7191 218.9681 232.2464 264.3334 300.4328 322.7794 346.4433 392.4136 424.4016 454.4009 468.2261 503.4491 523.7753 539.1349 588.0916 604.9226 635.6323 659.5698 679.1428 701.1325 713.9288 755.4144 789.2562 796.0030 810.9790 831.6896 896.6127 908.0334 951.1466 968.9291 976.4012 986.0025 1007.4702 1011.2677 1020.2663 1051.0784 1073.6935 1085.1964 1137.1851 1169.2013 1172.7639 1212.1728 1235.3039 1262.1582 1269.5596 1285.0621 1336.7582 1349.5677 1371.5974 1412.6884 1416.0832 1424.0983 1454.3003 1454.4957 1462.9333 1614.0756 1619.2357 1641.1406 1687.5479 1690.1235 2958.2206 3037.9671 3038.8271 3114.5275 3139.7972 3153.4704 3165.3029 3174.9954 3367.3903 3522.8851
redmass: 7.0831 6.9301 6.1060 7.7569 8.6486 4.3654 6.2799 6.7369 6.5439 7.1454 4.4180 2.9176 5.2451 5.6161 5.7559 3.7539 3.8642 4.8468 2.8091 2.4630 7.2158 6.5984 4.2459 7.8037 1.4675 4.8057 6.1988 5.5629 3.1753 3.2438 5.2286 1.7314 4.1568 4.4494 4.4738 1.4017 3.2499 5.7022 1.4124 2.7335 1.3479 2.8651 2.1043 2.6583 2.6046 2.1931 1.7815 1.1525 2.0072 3.3245 1.1319 1.6965 1.4091 1.5093 4.0393 1.4864 1.3959 1.0926 6.2143 1.3641 2.4134 2.4847 1.1514 7.7226 7.6770 12.3051 11.9289 8.6815 1.0633 1.0905 1.0589 1.1122 1.0864 1.0906 1.0956 1.1004 1.0761 1.0642
irintensity: 0.8627 0.7974 3.2226 0.8765 1.7794 1.5764 1.9536 2.0886 0.6505 1.1923 0.4220 5.6946 9.8498 5.6981 12.6030 2.5868 2.8938 0.0375 37.8422 32.6554 7.1140 10.3154 17.3961 55.5246 145.3468 0.0186 1.4821 3.8138 81.6211 55.2436 0.0622 46.1737 12.3875 3.3998 93.4944 0.0628 59.1513 0.7359 2.0292 16.5048 0.0038 77.0065 24.3446 269.8362 10.6559 19.7120 18.0940 6.0641 3.4970 16.1080 2.0611 28.4270 27.0402 3.4850 437.7798 44.0758 62.6557 32.2040 3.0737 13.2985 2.7233 11.6043 31.0694 0.9918 41.4976 418.4313 47.4554 215.1293 29.5239 6.5164 18.5335 3.1926 1.7633 5.2274 5.7891 21.2143 0.2733 32.9188
temp: 298.150 k
press: 1.00000 atm
elementType: 8 8 8 8 8 7 7 6 6 6 6 6 6 6 6 6 6 6 1 1 1 1 1 1 1 1 1 1
symmnumber: 1
zpe: 530242.2 jmol-1
zpe.correction: 0.201959 hartree
zpe.thermalcorrener: 0.218062 hartree
zpe.thermalcorrenthalpy: 0.219007 hartree
zpe.thermalcorrgfe: 0.154993 hartree
zpe.sumelectzpe: -909.461696 hartree
zpe.sumelectthermal: -909.445592 hartree
zpe.sumelectthermalent: -909.444648 hartree
zpe.sumelectthermalfe: -909.508661 hartree
dipole: -1.4019 -0.5586 -2.0116
dipole: 2.5147
quadrupole: -67.0647 -104.1870 -105.2501
quadrupole: 5.7066 -1.9126 -2.5318
quadrupole: 25.1026 -12.0197 -13.0828 5.7066 -1.9126 -2.5318
hfenergy: -909.6636543 hartree
pointgroup: C01 [X(C11H10N2O5)]
dipole: -0.5366001 -0.1034269 -0.824759 debye
polarizability: 208.9446545|-1.0345597|156.8725992|9.0793028|10.4360476|86.463873 unknown
InChI: InChI=1S/C11H10N2O5/c14-9(15)5-12-18-6-13-10(16)7-3-1-2-4-8(7)11(13)17/h1-4,12,14H,5-6H2
charge 0 multiplicity 1
28 atoms
O  1.780081 0.99055 -0.409382
O  -0.052078 -1.981392 0.183336
O  -1.126047 2.570798 0.808011
O  5.397545 -1.313745 -0.589393
O  3.882421 -0.912634 1.126945
N  -0.249418 0.363299 0.591463
N  3.129917 1.567523 -0.106657
C  -2.187443 -0.735377 -0.095365
C  -2.511344 0.630697 0.090485
C  -0.735626 -0.932809 0.215535
C  -1.278997 1.358925 0.528182
C  1.129974 0.658966 0.896153
C  -3.152853 -1.667635 -0.504977
C  -3.81228 1.110227 -0.126639
C  -4.470505 -1.192439 -0.729927
C  -4.79533 0.176024 -0.543359
C  4.138537 0.705832 -0.753439
C  4.411972 -0.554389 0.058651
H  1.183989 1.539795 1.557003
H  1.627442 -0.219288 1.338243
H  -2.889929 -2.72095 -0.643645
H  -4.050977 2.167968 0.02174
H  -5.250797 -1.890086 -1.052398
H  -5.821371 0.513665 -0.72456
H  3.101182 2.490892 -0.575579
H  5.085375 1.276371 -0.824902
H  3.862377 0.392841 -1.783033
H  5.566182 -2.146632 -0.071295
