program: Gaussian 09
title: 000290764
version: EM64L-G09RevD.01
frameworkgroup: C1[X(C9H10BrNO2)]
method: RPBEPBE
basis: SDD
operation: Freq
keyword: #p
keyword: freq=noraman
keyword: PBEPBE/SDD
title: #p freq=noraman PBEPBE/SDD
converged: YES YES NO NO
title: Mulliken charges:
elementType: Br O O N C C C C C C C C C H H H H H H H H H H
charge: 0.001750 -0.267655 -0.278114 -0.534857 0.457230 -0.640241 -0.409142 -0.349466 0.290568 -0.175956 -0.182146 -0.212353 -0.308126 0.241982 0.238656 0.240243 0.269131 0.250487 0.250380 0.237366 0.250958 0.300438 0.328866
chargesum: 0.00000
title: Mulliken charges with hydrogens summed into heavy atoms:
elementType: Br O O N C C C C C C C C C
charge: 0.001750 -0.267655 -0.278114 0.094447 0.457230 -0.159604 -0.168899 -0.080335 0.290568 0.074531 0.068234 -0.212353 0.180198
polarizability: 1.91835527e+02 7.09272934e+00 1.07886733e+02 1.32079695e+01 -1.11108392e+01 7.82169927e+01
1716.lowfreq: -7.0023 -0.0007 -0.0005 -0.0005 2.1690 6.4807 10.1637 31.3161 42.7181
frequency: 9.1025 31.3128 42.6986 82.8409 111.3549 132.8767 187.2125 233.2030 261.6873 299.2086 332.5603 353.9835 407.6512 451.5730 474.5198 498.8289 550.0367 576.4162 623.2228 646.0801 688.4096 698.3682 738.2573 799.0794 832.5862 834.9144 865.4758 903.0735 937.5698 958.4909 972.2367 995.5257 1060.2374 1094.6864 1119.6726 1189.0012 1192.6068 1202.0266 1204.4828 1239.1043 1282.9261 1302.9103 1331.5790 1345.8033 1374.3461 1394.3897 1448.8113 1452.9076 1472.1912 1581.9661 1593.4525 1607.8527 1644.3179 3011.9509 3067.7631 3097.7706 3136.8700 3146.1517 3155.9089 3169.5139 3173.0885 3531.8611 3666.5224
redmass: 5.4561 4.0925 5.1768 5.7971 4.3917 7.8913 5.3449 3.0955 5.9900 7.0467 5.0602 2.5804 2.8783 1.5953 1.9237 2.4055 4.8554 1.7724 6.4791 4.0589 5.4879 4.2243 4.9617 2.1170 1.3355 2.4026 1.8766 1.8615 1.9114 1.4728 1.3762 5.1884 2.5546 1.7156 1.4416 1.1822 1.4379 2.4903 1.9717 2.1005 1.5154 1.3849 1.2382 1.2683 7.3382 2.4237 1.1559 1.1324 2.2080 7.4123 6.2313 7.8463 1.1228 1.0626 1.0586 1.0991 1.0895 1.0895 1.1130 1.0954 1.0966 1.0448 1.1019
irintensity: 1.2502 0.5873 0.4066 1.8970 2.2810 1.1204 0.6592 1.4206 11.5687 2.7249 4.7326 31.4129 0.0195 157.5768 19.4556 27.4708 1.5998 150.9517 10.4288 185.0195 279.5385 62.6323 22.6305 38.0604 8.3354 129.1750 19.8877 23.3263 5.7438 6.9475 0.9790 61.7050 28.2995 110.0839 94.1936 19.1198 58.9104 29.1237 54.4694 71.9301 53.5702 22.6288 1.2465 12.2515 4.6920 11.9186 8.9749 27.5285 83.9673 0.9990 34.7580 143.5174 62.7419 13.2387 27.8417 6.4864 9.0121 1.5881 12.1364 8.9846 0.3539 21.8001 21.1582
temp: 298.150 k
press: 1.00000 atm
elementType: 35 8 8 7 6 6 6 6 6 6 6 6 6 1 1 1 1 1 1 1 1 1 1
symmnumber: 1
zpe: 459503.8 jmol-1
zpe.correction: 0.175016 hartree
zpe.thermalcorrener: 0.188130 hartree
zpe.thermalcorrenthalpy: 0.189074 hartree
zpe.thermalcorrgfe: 0.131239 hartree
zpe.sumelectzpe: -566.661026 hartree
zpe.sumelectthermal: -566.647911 hartree
zpe.sumelectthermalent: -566.646967 hartree
zpe.sumelectthermalfe: -566.704803 hartree
dipole: 3.5383 1.6473 0.3238
dipole: 3.9164
quadrupole: -74.7622 -82.6095 -84.7206
quadrupole: 4.1109 0.9497 -1.1954
quadrupole: 5.9353 -1.9121 -4.0232 4.1109 0.9497 -1.1954
hfenergy: -566.8360414 hartree
pointgroup: C01 [X(C9H10Br1N1O2)]
dipole: 1.3408151 0.5810286 0.4886046 debye
dipolederiv: -0.6897022 -0.0582204 -0.2434925 -0.0648116 -0.0823052 -0.0259768 -0.2732123 -0.0268112 -0.1524107 -1.6157171 -0.1603451 0.390874 -0.261147 -0.7266437 0.1894655 0.9799969 0.1265295 -0.643148 -0.6912921 0.13602 0.1031199 -0.1144975 -0.8898616 0.0943909 0.2419178 -0.1022421 -0.4070977 -1.2491025 0.2537798 0.303736 0.521481 -0.3456543 -0.083856 0.1176955 0.0586743 -0.650488 0.4539534 -0.0033408 0.0812507 0.0865628 -0.0620057 -0.0321035 0.2977039 -0.0318973 -0.0357391 -0.4616531 0.0786442 0.1257143 0.0995821 0.0780844 0.0119179 0.1428801 -0.0453089 0.0062126 -0.1049293 0.053898 0.0631427 -0.0393724 0.0647192 0.0078866 0.022545 0.0247894 -0.1189367 -0.0775099 -0.0664363 0.0452286 -0.0321761 0.0185874 0.0119919 0.0070591 0.0081814 -0.1235567 1.317177 0.0902197 -0.4893561 0.5379306 1.1877617 -0.3021351 -0.9552026 -0.0346491 0.5015825 -0.3292818 -0.1370132 -0.0926317 -0.0654135 0.0021107 -0.0274006 -0.1144689 -0.0538455 -0.1300032 -0.3592125 0.0644163 -0.0978007 0.0020588 0.04853 -0.0016989 -0.1189536 0.036247 -0.1336065 1.1266312 0.1116082 0.5059978 0.1120709 0.0429609 0.0529652 0.5361042 0.0553885 0.0905457 1.7963938 -0.1975934 -0.2786957 -0.617992 0.4255582 0.0611677 -0.4233918 -0.0889709 0.6575546 0.0105598 0.0028518 -0.0206732 0.0251558 0.0414791 0.1005688 -0.0303524 0.0409377 -0.0417711 0.0562014 -0.0007585 -0.0074773 -0.0533806 -0.0729408 -0.0673047 -0.0016045 -0.0148276 0.0904908 0.042853 -0.0854368 -0.0576068 -0.068657 -0.0487418 -0.0348173 -0.0480534 -0.0418229 0.1240013 0.073372 0.0746876 -0.0543318 0.0660734 0.023548 0.0136264 -0.0434974 0.0098264 0.1253374 0.0460835 0.0750653 -0.0396268 0.0739082 0.000786 0.0233111 -0.0483291 0.0250995 0.1458634 0.0742159 -0.0553511 -0.0330487 -0.0587886 -0.0242173 -0.0295345 -0.0410238 -0.0320035 0.1434736 -0.0014225 -0.0305058 0.0412541 -0.0107048 -0.0607332 0.0950565 0.0849477 0.0362914 0.0515395 -0.0702178 -0.0294641 -0.0551477 0.0011887 0.0481205 -0.1129639 0.0289729 -0.0313926 -0.0160959 0.3284975 -0.0128821 -0.1123104 -0.0285741 0.1458845 -0.0148432 -0.2113915 -0.0287461 0.2376052 0.3241024 -0.1038434 -0.0781185 -0.1104973 0.184973 0.070286 -0.150342 0.1105526 0.278647 unknown
polarizability: 187.5717617|2.9297898|111.5920867|26.3318523|2.1571168|78.7754036 unknown
InChI: InChI=1S/C9H10BrNO2/c10-8-3-1-7(2-4-8)5-9(12)13-6-11/h1-4H,5-6,11H2
charge 0 multiplicity 1
23 atoms
Br -4.852391 -0.272303 -1.139454
O  2.756601 0.826541 -0.103746
O  2.18648 -1.408514 0.229456
N  4.943545 -0.3697 -0.496226
C  -0.480977 0.210006 0.763522
C  0.908587 0.365855 1.379458
C  -1.269727 1.348707 0.470364
C  -1.005087 -1.076347 0.475432
C  2.000157 -0.183587 0.458943
C  -2.56123 1.218044 -0.092012
C  -2.291831 -1.22603 -0.087077
C  -3.05598 -0.07292 -0.361573
C  3.877303 0.321885 -1.098493
H  0.964383 -0.206918 2.323964
H  1.120084 1.424215 1.597511
H  -0.879113 2.351424 0.678479
H  -0.396805 -1.964788 0.6769
H  -3.162991 2.104063 -0.313385
H  -2.688432 -2.221408 -0.306439
H  4.185763 1.28066 -1.536594
H  3.339278 -0.312681 -1.818544
H  5.626811 0.153271 0.048366
H  4.766774 -1.329772 -0.202252
