program: Gaussian 09
title: 000290758
version: EM64L-G09RevD.01
frameworkgroup: C1[X(C25H22N2O8S)]
method: RPBEPBE
basis: SDD
operation: Freq
keyword: #p
keyword: freq=noraman
keyword: PBEPBE/SDD
title: #p freq=noraman PBEPBE/SDD
converged: YES YES NO NO
title: Mulliken charges:
elementType: S O O O O O O O O N N C C C C C C C C C C C C C C C C C C C C C C C C C H H H H H H H H H H H H H H H H H H H H H H
charge: 0.230448 -0.304234 -0.309321 -0.219977 -0.188355 -0.290954 -0.208106 -0.208976 -0.204343 -0.394073 0.024488 -0.179963 -0.709407 0.218460 0.325140 -0.461422 0.508045 0.418581 -0.501012 0.466620 -0.358393 -0.284048 0.032502 -0.443806 -0.381082 0.377620 -0.334340 -0.347373 -0.358691 -0.371329 -0.217782 -0.239673 -0.240623 -0.250912 -0.237767 -0.245725 0.298310 0.333380 0.293769 0.372418 0.223870 0.264132 0.236342 0.251365 0.281000 0.306329 0.233515 0.279386 0.290143 0.290774 0.286233 0.240391 0.228260 0.230327 0.230297 0.246604 0.234358 0.238581
chargesum: 0.00000
title: Mulliken charges with hydrogens summed into heavy atoms:
elementType: S O O O O O O O O N N C C C C C C C C C C C C C C C C C C C C C C C C C
charge: 0.230448 -0.304234 -0.309321 -0.219977 -0.188355 -0.290954 -0.208106 -0.208976 -0.204343 -0.021655 0.024488 0.118347 -0.082257 0.218460 0.325140 0.026580 0.508045 0.418581 -0.013306 0.466620 -0.077393 0.022281 0.032502 -0.210291 -0.101696 0.377620 -0.044198 -0.056599 -0.072458 -0.130938 0.010478 -0.009346 -0.010326 -0.004309 -0.003409 -0.007144
polarizability: 3.95412374e+02 -3.51660730e+00 3.37805540e+02 -3.95141123e+00 -4.68293529e+00 2.48010439e+02
1716.lowfreq: -5.5712 -3.6567 -0.0012 -0.0008 -0.0003 7.6845 8.4442 12.3999 16.1586
frequency: 7.1401 12.0650 16.0314 20.4635 23.7889 26.6298 30.3375 39.3225 44.4460 48.2578 56.4433 58.8959 68.2741 69.2963 77.0452 97.6220 104.3629 132.5384 149.0480 154.5252 156.1390 164.7234 195.5383 222.8765 227.1795 242.9931 251.6981 272.9186 289.0752 314.0194 321.0448 330.7365 340.6235 383.4670 391.6297 401.7773 403.9505 408.2368 414.2404 443.9120 453.2665 492.5958 496.7416 496.9900 507.9148 528.3280 571.7633 574.0044 581.6738 596.1929 614.1867 616.5507 616.9624 621.5665 634.4099 649.6083 663.5413 679.6979 700.1359 703.1703 706.1552 730.0786 737.6277 743.8905 753.4465 760.4100 762.7526 797.5188 812.6647 813.9969 831.2280 843.4265 853.6035 855.7397 863.2770 868.5466 872.9384 910.5042 916.4870 940.8474 960.6806 975.0170 977.2937 983.2698 987.7981 988.5895 989.6525 990.3149 995.9413 997.9184 1000.4307 1006.8202 1013.5792 1023.6914 1028.6545 1051.9763 1092.5288 1092.6553 1093.2169 1111.4174 1123.8560 1138.7143 1157.7597 1173.1944 1173.6089 1189.6847 1190.1748 1192.0938 1197.5584 1211.9758 1217.1162 1220.5663 1221.9838 1223.0901 1237.0571 1248.5077 1291.9612 1296.8173 1324.6276 1330.2478 1331.3249 1333.4612 1357.6189 1363.8885 1383.3085 1387.4446 1403.5217 1411.1656 1422.7556 1441.0351 1442.0493 1464.9023 1466.6735 1472.3416 1477.2576 1483.7386 1488.3580 1591.3853 1592.3847 1595.3538 1606.8550 1611.3184 1614.7726 1616.5652 1651.6240 1662.3194 3005.7843 3008.0370 3048.7011 3048.9286 3078.6455 3117.5156 3123.6171 3126.8825 3128.2621 3131.8498 3133.5139 3140.8291 3146.1195 3154.6033 3155.3934 3165.5035 3166.5286 3168.4302 3182.3182 3190.4942 3215.4059 3573.6807
redmass: 6.3235 5.6617 6.0517 5.4157 5.4816 5.2741 6.6275 5.0951 6.1028 5.6373 8.3070 7.6628 7.0855 10.6106 9.2549 12.7995 9.1905 7.6321 6.4117 7.3183 6.7391 7.3333 5.7517 7.3371 8.4854 5.8257 5.1843 5.7809 4.9770 4.0611 5.4488 4.7549 2.7950 6.8233 3.1755 2.8231 2.8502 4.3993 3.0018 3.7653 11.3910 4.1696 3.7154 4.2081 6.8550 6.3392 2.6418 5.0786 1.7627 4.0776 6.3816 6.3179 6.4238 6.0676 6.0077 7.7618 4.7651 6.1288 4.6515 2.3404 1.9415 5.0852 5.3075 8.0770 1.8551 2.3844 5.1587 8.1922 3.7796 3.6518 5.5076 1.2578 2.1421 1.8887 1.3629 2.1930 1.7478 3.6178 1.5477 1.4417 3.0877 1.7458 1.4258 3.1147 1.3778 1.4484 6.1750 4.0283 1.3511 1.4350 2.9093 1.3184 2.6239 2.2249 2.2133 7.8727 2.0813 2.0123 1.5585 1.3083 1.7933 6.2322 2.0675 1.0533 1.0564 1.5497 1.1968 1.3213 1.4443 1.7058 1.2722 2.2602 2.1010 5.6404 1.3018 1.4048 1.2810 1.4553 1.2848 1.2629 1.2674 1.2642 1.4176 8.2577 8.4764 5.4568 11.4210 1.0917 3.8572 2.1690 2.1453 1.1476 2.0630 1.4186 1.6497 2.2719 2.2009 6.0153 7.2433 6.0335 7.1604 6.0989 8.2527 6.6815 9.7563 11.1722 1.0816 1.0589 1.0585 1.0583 1.1056 1.0871 1.0872 1.0871 1.1069 1.1080 1.0894 1.0924 1.0918 1.0957 1.0962 1.1011 1.0922 1.0999 1.0913 1.0962 1.0954 1.0780
irintensity: 0.1317 0.2021 0.0367 0.1631 0.1386 0.0910 0.3349 0.1725 0.3614 0.0656 2.0234 5.4083 0.3171 4.6765 1.6444 0.1954 1.6616 0.1099 0.8587 0.9249 1.5553 4.0301 2.6881 4.3742 0.6114 13.2982 4.0769 6.8742 5.6030 11.0566 1.6959 7.7460 2.2247 6.4339 12.3167 2.5351 0.1722 2.7116 0.1538 6.0308 1.2833 13.7293 8.3622 20.1057 1.7544 3.2592 23.5798 8.3147 123.3138 5.3778 0.7086 0.7088 0.4333 2.6916 14.0594 18.5282 18.2034 8.9696 37.8140 53.9095 50.0548 7.7734 53.3041 9.9589 68.2552 22.1004 44.8482 19.7007 5.7817 15.9685 16.1693 1.5829 1.6609 0.9827 0.7344 34.7349 38.0953 132.1424 1.6112 1.8692 187.6239 0.4815 1.3885 75.9292 1.4662 0.2167 5.1811 0.9057 0.4311 9.3802 12.3648 0.3106 55.2466 8.9473 5.6389 500.4551 16.5337 0.2384 3.9764 45.8232 404.6401 340.8889 146.9756 0.0834 1.2690 27.1390 8.4124 8.0242 106.3575 203.2944 12.8816 23.3659 25.4704 233.5683 8.0477 17.6507 0.4826 25.6779 15.2982 0.7458 33.3673 19.9566 3.8530 80.8925 1.6542 1.0917 14.7025 38.4794 65.5546 9.7798 22.4610 6.4838 290.0511 43.2994 196.0364 8.5864 20.8636 3.6784 61.5734 0.6922 49.4909 10.6492 157.6973 72.2783 299.6531 132.4418 13.2962 33.2023 26.6395 8.5296 13.5387 7.5600 0.9229 1.7978 4.2760 0.2209 6.2862 25.3775 22.3836 17.2820 9.6197 18.4422 1.5858 9.7552 1.7308 2.4475 2.5479 83.7333
temp: 298.150 k
press: 1.00000 atm
elementType: 16 8 8 8 8 8 8 8 8 7 7 6 6 6 6 6 6 6 6 6 6 6 6 6 6 6 6 6 6 6 6 6 6 6 6 6 1 1 1 1 1 1 1 1 1 1 1 1 1 1 1 1 1 1 1 1 1 1
symmnumber: 1
zpe: 1125651.7 jmol-1
zpe.correction: 0.428738 hartree
zpe.thermalcorrener: 0.462323 hartree
zpe.thermalcorrenthalpy: 0.463267 hartree
zpe.thermalcorrgfe: 0.354909 hartree
zpe.sumelectzpe: -2072.573126 hartree
zpe.sumelectthermal: -2072.539541 hartree
zpe.sumelectthermalent: -2072.538597 hartree
zpe.sumelectthermalfe: -2072.646955 hartree
dipole: 4.6682 2.0321 -0.4165
dipole: 5.1084
quadrupole: -257.6490 -216.3839 -205.0374
quadrupole: 24.2677 -1.3642 2.5337
quadrupole: -31.2923 9.9729 21.3193 24.2677 -1.3642 2.5337
hfenergy: -2073.001864 hartree
pointgroup: C01 [X(C25H22N2O8S1)]
dipole: -1.9095689 -0.4897269 -0.3910759 debye
polarizability: 391.1606442|-13.6272493|338.5071397|16.4594284|11.8920951|251.5605693 unknown
InChI: InChI=1S/C25H22N2O8S/c28-23(35-21-13-11-20(12-14-21)27(31)32)22(26-24(29)33-15-18-7-3-1-4-8-18)17-36-25(30)34-16-19-9-5-2-6-10-19/h1-14,22,26H,15-17H2
charge 0 multiplicity 1
58 atoms
S  0.294218 1.76178 2.827066
O  2.042128 1.144993 -0.151934
O  -2.234459 1.409014 -1.71743
O  -1.019057 -0.495101 2.99951
O  2.88185 3.230386 0.561931
O  -2.017138 3.641996 -0.958628
O  -2.204321 1.139259 1.802801
O  6.303461 -3.572065 -0.260893
O  7.73512 -1.803773 -0.087928
N  -0.374991 2.025335 -0.562562
N  6.548648 -2.306936 -0.167402
C  0.470441 2.945615 0.191222
C  -0.018785 3.207595 1.651011
C  1.93589 2.501798 0.215597
C  -1.578047 2.465259 -1.062395
C  -3.568707 1.738513 -2.308826
C  -4.640174 0.852258 -1.711347
C  3.234835 0.37054 -0.122583
C  -1.982899 -1.583509 2.538649
C  -1.434952 -2.234073 1.290153
C  2.998193 -1.020989 -0.220841
C  4.54404 0.903664 -0.036475
C  -1.206708 0.754975 2.445047
C  -5.472218 0.074248 -2.552877
C  -4.846577 0.817436 -0.307498
C  5.395259 -1.376389 -0.151272
C  4.087653 -1.906591 -0.235197
C  5.633709 0.010801 -0.051755
C  -1.795161 -1.742143 0.007954
C  -0.52207 -3.315661 1.388338
C  -6.508212 -0.718079 -2.006254
C  -5.876415 0.021079 0.238111
C  -6.713398 -0.74555 -0.608409
C  -1.239599 -2.317879 -1.156715
C  0.028173 -3.896082 0.223754
C  -0.328058 -3.395665 -1.052017
H  0.436904 3.934004 -0.308846
H  -1.099462 3.41991 1.637773
H  0.531456 4.054698 2.090561
H  -0.113407 1.042679 -0.648615
H  -3.468013 1.575864 -3.395277
H  -3.757039 2.810278 -2.111122
H  -2.001785 -2.261976 3.404371
H  -2.969594 -1.117911 2.378792
H  1.969773 -1.389725 -0.276586
H  4.705874 1.977955 0.050853
H  -5.313401 0.089272 -3.638535
H  -4.196708 1.400246 0.354041
H  3.946059 -2.987559 -0.306599
H  6.662074 0.37537 0.012635
H  -2.504251 -0.91247 -0.083082
H  -0.23956 -3.698414 2.376512
H  -7.148189 -1.312975 -2.667414
H  -6.032789 0.004583 1.322788
H  -7.515154 -1.358984 -0.182225
H  -1.527227 -1.929343 -2.139448
H  0.723354 -4.7388 0.308499
H  0.092907 -3.849564 -1.956385
