program: Gaussian 09
title: 000290754
version: EM64L-G09RevD.01
frameworkgroup: C1[X(C16H16N2O4S2)]
method: RPBEPBE
basis: SDD
operation: Freq
keyword: #p
keyword: freq=noraman
keyword: PBEPBE/SDD
title: #p freq=noraman PBEPBE/SDD
converged: YES YES NO NO
title: Mulliken charges:
elementType: S S O O O O N N C C C C C C C C C C C C C C C C H H H H H H H H H H H H H H H H
charge: 0.169746 0.423501 -0.389503 -0.259801 -0.205577 -0.207184 -0.704032 0.011929 -0.073595 -0.699430 -0.852780 0.501198 0.215241 -0.399611 -0.377593 -0.378613 0.458155 -0.116160 -0.219715 -0.216715 -0.338014 -0.236493 -0.242157 -0.201223 0.289769 0.277248 0.263498 0.269853 0.310825 0.322229 0.236140 0.238542 0.297419 0.226932 0.226052 0.287522 0.229569 0.239478 0.243351 0.379998
chargesum: 0.00000
title: Mulliken charges with hydrogens summed into heavy atoms:
elementType: S S O O O O N N C C C C C C C C C C C C C C C C
charge: 0.169746 0.423501 -0.009505 -0.259801 -0.205577 -0.207184 -0.381803 0.011929 0.216175 -0.158684 -0.272102 0.501198 0.215241 -0.399611 -0.141453 -0.140072 0.458155 0.181258 0.007217 0.009337 -0.050492 -0.006923 -0.002679 0.042129
polarizability: 3.98879016e+02 -1.08862387e+01 2.48304429e+02 1.49452420e+01 5.95269804e+00 1.37807999e+02
1716.lowfreq: -8.3711 -4.8755 -0.0015 -0.0008 0.0017 4.4440 9.1480 10.8365 19.0444
frequency: 6.9249 10.5264 18.8745 22.4551 28.0654 35.5041 47.5935 91.4423 94.4982 102.2876 116.8348 127.4328 140.5547 161.5882 195.5006 217.1081 233.3772 245.6131 277.9897 303.4820 330.5337 339.6939 349.6924 369.1922 401.7023 426.4714 434.8480 458.9482 470.9551 492.8731 499.3085 534.9822 555.5424 585.0817 611.8754 617.0259 641.7401 644.1618 662.6965 675.1022 681.3280 700.3483 704.8574 724.0254 761.6266 777.1049 788.3796 790.2394 799.0443 810.6387 852.1917 900.4090 908.3838 926.0672 948.6339 977.0993 987.0335 989.9215 995.7998 1011.3546 1018.7854 1025.9435 1026.4913 1031.6281 1045.1593 1074.5161 1086.5003 1094.1809 1133.8600 1138.9787 1158.5522 1168.9096 1172.6651 1186.7573 1209.7480 1221.9022 1227.5156 1239.4868 1242.8283 1256.6749 1296.1841 1326.3945 1346.1192 1350.8295 1385.4297 1392.6532 1397.5596 1426.5417 1429.7663 1437.3859 1441.0508 1474.5465 1483.5680 1570.5844 1593.4821 1594.8176 1613.4272 1636.8845 3026.1678 3034.8507 3081.2227 3105.6737 3116.7420 3120.7742 3123.3539 3135.8667 3136.0056 3147.4041 3150.5146 3164.0958 3165.0604 3183.6297 3454.3750 3499.4644
redmass: 6.2756 6.2535 5.5611 6.2830 5.8336 7.7966 8.0488 6.3554 6.2665 6.5276 8.8973 5.2259 7.9584 9.7357 9.7152 5.7383 5.4452 2.9102 6.1216 4.8959 5.6528 2.3509 8.7583 10.8364 2.7970 4.3106 3.7265 7.4319 3.7503 3.6909 3.2290 7.3518 5.6708 3.2563 1.3227 5.7944 6.7689 4.4904 5.7257 6.8827 5.6915 1.9510 2.3296 3.5376 2.9634 2.2410 1.4953 8.5627 2.5866 3.5029 1.2492 1.3271 1.4621 1.4564 1.9550 1.3945 1.3467 6.1132 1.3240 1.3307 4.6310 2.7437 2.2018 3.8364 4.2843 1.5271 1.9053 2.9764 1.6925 1.0795 1.3460 1.1334 1.0520 1.1109 5.1664 1.9007 1.4231 1.6200 1.4648 1.2248 1.2332 1.2728 1.9852 5.8995 8.3248 2.1010 2.0274 2.5630 1.1039 2.4502 2.1585 1.1170 2.3420 7.0027 6.0828 6.4101 6.1321 7.9772 1.0570 1.0583 1.0872 1.1090 1.1060 1.0852 1.0880 1.0920 1.0866 1.0964 1.0915 1.1017 1.0936 1.0984 1.0755 1.0640
irintensity: 0.0945 0.1311 1.1259 1.9722 0.1461 0.2297 3.2227 1.5836 1.2806 1.1982 0.4359 1.5215 7.3722 0.7203 4.4305 0.3347 6.8302 3.9622 2.2115 8.3318 9.3168 0.3052 6.0051 1.6429 0.0218 1.0005 0.5695 15.0672 3.0573 31.8750 42.1056 0.3210 10.9733 3.8699 132.5214 2.0178 7.8476 42.3972 11.1782 16.0497 14.1363 46.8367 61.6654 16.0254 14.2226 28.3993 48.2787 5.5032 78.8936 12.6681 0.1827 1.3446 0.5917 0.9804 37.5981 0.1478 4.5665 0.2135 0.1648 1.2088 8.5696 52.9978 12.8475 93.8018 110.2340 10.4067 56.7990 10.7658 9.1473 5.1721 8.8808 8.8161 0.0404 1.8047 201.7459 1.6910 2.6463 24.4741 0.6823 10.9770 6.3904 0.3555 59.3105 177.6378 0.3087 18.4918 13.2021 1.9221 18.9547 119.1486 10.6386 4.9285 14.5707 26.9858 2.2409 38.7636 2.7778 222.6453 18.6360 16.5565 1.0962 2.4997 6.4446 6.1585 1.0769 15.4491 9.2229 39.8350 4.1390 27.2010 15.6426 9.5337 18.0147 24.2468
temp: 298.150 k
press: 1.00000 atm
elementType: 16 16 8 8 8 8 7 7 6 6 6 6 6 6 6 6 6 6 6 6 6 6 6 6 1 1 1 1 1 1 1 1 1 1 1 1 1 1 1 1
symmnumber: 1
zpe: 772895.7 jmol-1
zpe.correction: 0.294380 hartree
zpe.thermalcorrener: 0.317941 hartree
zpe.thermalcorrenthalpy: 0.318885 hartree
zpe.thermalcorrgfe: 0.234384 hartree
zpe.sumelectzpe: -1823.977869 hartree
zpe.sumelectthermal: -1823.954309 hartree
zpe.sumelectthermalent: -1823.953365 hartree
zpe.sumelectthermalfe: -1824.037866 hartree
dipole: 2.1265 4.0650 1.4779
dipole: 4.8198
quadrupole: -160.0673 -143.0150 -158.5611
quadrupole: -27.7418 -5.7228 2.3248
quadrupole: -6.1861 10.8661 -4.6800 -27.7418 -5.7228 2.3248
hfenergy: -1824.2722495 hartree
pointgroup: C01 [X(C16H16N2O4S2)]
dipole: 0.6984263 -1.7628601 -0.0187691 debye
polarizability: 399.0918639|-7.027748|240.2882922|-17.5163326|-28.0834925|145.6112878 unknown
InChI: InChI=1S/C16H16N2O4S2/c19-16(20)13(11-23-10-12-6-2-1-3-7-12)17-24-15-9-5-4-8-14(15)18(21)22/h1-9,13,17,19H,10-11H2
charge 0 multiplicity 1
40 atoms
S  2.363452 -1.132702 0.772552
S  -2.546702 1.046898 -0.995777
O  0.78985 2.316288 -0.341129
O  1.648529 0.922523 -1.991419
O  -6.616391 2.23781 0.316628
O  -4.565113 2.571178 -0.632886
N  -1.202532 -0.174013 -1.169094
N  -5.453762 1.814862 -0.046375
C  0.021191 0.015545 -0.34647
C  0.770652 -1.326545 -0.242272
C  3.669047 -1.292871 -0.637699
C  5.009639 -0.807197 -0.146264
C  0.932687 1.085951 -0.972559
C  -3.79584 -0.056407 -0.191495
C  5.899862 -1.683976 0.526641
C  5.399091 0.543133 -0.346442
C  -5.079533 0.420906 0.196081
C  -3.496167 -1.416061 0.062382
C  7.152785 -1.222689 0.988384
C  6.652271 1.005641 0.111261
C  -6.034399 -0.421354 0.819725
C  7.532657 0.123895 0.781614
C  -4.439867 -2.258781 0.679182
C  -5.713951 -1.765098 1.063368
H  -0.287914 0.362421 0.652303
H  0.134915 -2.073158 0.257779
H  1.053599 -1.696776 -1.242543
H  3.691922 -2.357179 -0.923462
H  3.286446 -0.679406 -1.46922
H  -1.005426 -0.362982 -2.162304
H  5.607556 -2.728745 0.68839
H  4.716063 1.224448 -0.868078
H  -2.510515 -1.779385 -0.246978
H  7.83144 -1.91039 1.505323
H  6.943915 2.048795 -0.05503
H  -7.001786 0.008689 1.093378
H  8.505309 0.482123 1.137155
H  -4.182377 -3.307684 0.862164
H  -6.442628 -2.424967 1.543789
H  1.334026 3.008162 -0.8084
