program: Gaussian 09
title: 000290735
version: EM64L-G09RevD.01
frameworkgroup: C1[X(C7H9N3O3)]
method: RPBEPBE
basis: SDD
operation: Freq
keyword: #pfreq=noraman
keyword: PBEPBE/SDD
title: #p freq=noraman PBEPBE/SDD
converged: YES YES NO NO
title: Mulliken charges:
elementType: O O O N N N C C C C C C C H H H H H H H H H
charge: -0.452382 -0.235662 -0.226913 -0.436835 -0.059693 -0.625888 0.276671 -0.531350 0.152108 0.101278 -0.681160 -0.019670 0.133392 0.275015 0.193956 0.227566 0.243414 0.214378 0.373908 0.330706 0.345366 0.401795
chargesum: 0.00000
title: Mulliken charges with hydrogens summed into heavy atoms:
elementType: O O O N N N C C C C C C C
charge: -0.050588 -0.235662 -0.226913 -0.062927 -0.059693 0.050184 0.276671 -0.062378 0.152108 0.101278 0.004198 -0.019670 0.133392
polarizability: 1.33116270e+02 5.66124276e+00 1.46338344e+02 -3.11297395e+00 -5.30026109e+00 5.62493968e+01
1716.lowfreq: -11.8498 -4.6947 0.0010 0.0011 0.0012 13.4989 50.7799 56.6769 70.4593
frequency: 50.7606 56.6682 70.3697 129.0515 175.3207 189.3385 196.7111 206.0785 325.6412 356.3333 372.9104 389.5834 410.0739 418.1178 464.2091 504.2572 543.2833 597.5758 612.2918 618.2912 628.5989 695.5773 722.5592 731.2097 769.9846 774.4712 789.9178 869.7583 928.2886 963.3366 1015.4031 1053.8145 1061.8105 1102.2607 1171.9617 1211.0611 1241.1999 1271.3746 1319.2734 1321.6381 1389.4651 1392.3062 1442.6301 1471.8405 1479.5462 1489.9878 1507.7887 1601.5048 1626.0641 1648.7636 1657.5333 2982.1242 2986.2021 3073.4313 3090.3895 3098.4684 3525.8439 3543.8804 3548.5674 3701.6111
redmass: 4.0552 9.3287 3.2146 6.4904 4.0777 1.4078 2.6670 6.1716 5.2592 3.3561 2.8091 2.3092 5.1469 1.9579 3.7101 4.0062 5.2561 1.2173 1.4579 4.4519 4.0627 2.4144 7.5215 5.1275 1.7931 5.5869 1.2961 4.4076 3.9328 2.3799 2.5463 1.9423 2.4727 1.6895 2.9902 2.1656 3.7586 1.4072 2.1436 1.5257 1.2189 2.3372 4.1711 1.0417 1.2260 1.2213 2.6968 1.8182 3.3738 5.4165 7.4532 1.0663 1.0384 1.0967 1.0967 1.0984 1.0774 1.0459 1.0649 1.1038
irintensity: 4.2931 2.0290 0.9329 0.6478 0.5772 1.9675 3.9163 3.5497 3.5315 4.8568 12.0279 34.1777 12.6090 102.8924 2.4865 8.2280 12.4291 247.4164 4.9229 9.6176 35.2574 27.5911 22.3517 8.3988 91.4011 16.1603 9.5114 7.8886 34.9553 7.9037 218.5867 7.2188 102.1218 111.2536 21.2751 7.8585 21.7498 2.6535 136.9898 9.3612 14.5447 23.4093 151.9770 12.7106 14.0340 60.3737 74.7169 92.2813 499.7543 491.8978 182.5655 37.2738 33.2415 13.7906 31.4645 15.2828 122.0561 78.9829 77.4434 41.5525
temp: 298.150 k
press: 1.00000 atm
elementType: 8 8 8 7 7 7 6 6 6 6 6 6 6 1 1 1 1 1 1 1 1 1
symmnumber: 1
zpe: 434174.5 jmol-1
zpe.correction: 0.165368 hartree
zpe.thermalcorrener: 0.177872 hartree
zpe.thermalcorrenthalpy: 0.178816 hartree
zpe.thermalcorrgfe: 0.126228 hartree
zpe.sumelectzpe: -661.136710 hartree
zpe.sumelectthermal: -661.124207 hartree
zpe.sumelectthermalent: -661.123262 hartree
zpe.sumelectthermalfe: -661.175850 hartree
dipole: 5.6473 2.7106 -0.6165
dipole: 6.2944
quadrupole: -98.8934 -55.1376 -76.3631
quadrupole: -13.5838 2.1832 -1.2862
quadrupole: -22.0954 21.6604 0.4349 -13.5838 2.1832 -1.2862
hfenergy: -661.3020783 hartree
pointgroup: C01 [X(C7H9N3O3)]
dipole: 2.1732671 1.1578203 -0.2626204 debye
dipolederiv: -0.3012185 0.0039055 -0.006127 0.1010987 -1.4343973 0.0050367 -0.0031797 0.0330126 -0.4289118 -1.0886065 -0.4703236 0.08235 -0.6141018 -0.8501958 0.0835669 0.121148 0.0846623 -0.4115956 -1.0774405 0.0200695 0.0520416 -0.003287 -0.6095473 -0.0031246 0.032872 0.0055576 -0.2903136 -0.929062 -0.6667507 0.0793845 0.1666128 -0.6815693 0.0106308 0.0429738 0.1008429 -0.2478689 -0.6663 -0.388056 0.0580304 -0.4550573 -1.1865642 0.1176735 0.0630518 0.1066289 -0.3125996 -0.2823351 0.2759409 -0.0652767 0.0963278 -1.363468 0.0717523 -0.0634813 0.0455964 -0.6639076 -0.2423025 0.4999006 -0.0043958 0.0245617 -0.1894943 0.0340259 -0.0106197 -0.0237153 -0.0620077 0.019754 -0.0507932 0.0224447 0.0061479 0.0205391 -0.0698042 0.007346 -0.1768163 0.068965 -0.1690156 0.8331422 -0.030832 0.4285412 0.267512 -0.0737596 -0.0172832 -0.0773662 0.0802488 0.7888132 -0.2290455 -0.0288477 -0.0512255 1.6475983 -0.128526 -0.0390964 -0.1054136 0.2083915 0.055939 -0.0364338 -0.0353094 -0.0258473 0.0333396 -0.0014375 0.0133993 0.1047142 0.0175034 1.7308729 0.6714216 -0.1519608 0.7303243 1.3309577 -0.1602409 -0.1839497 -0.1489068 0.2720961 1.421599 -0.3616889 -0.0576482 -0.2736372 1.8365446 -0.0032759 -0.0354519 -0.0381441 0.2376974 -0.0052585 -0.0163936 0.0573142 0.0578243 0.0780953 -0.0706137 0.0230127 -0.0382368 0.0447321 0.0443017 0.0437131 -0.103191 -0.0013914 -0.0831599 0.1200785 -0.0632025 0.0918803 -0.0287487 -0.0552455 -0.1696187 0.0104911 -0.1545152 -0.066848 0.0016514 0.0186654 -0.0067172 0.061318 0.0649433 0.0313625 -0.0570016 0.0853074 -0.0040328 0.1078114 -0.0399455 0.0550776 -0.0001182 -0.0413757 0.1167278 0.1051483 0.0598089 0.0425951 -0.0677741 0.0589404 -0.0396286 0.014223 0.2205298 -0.024918 0.0110951 -0.0183375 0.3049869 0.0081542 0.0058613 0.0020111 0.3258353 0.1850328 -0.0175269 0.027307 -0.0586378 0.2508252 0.002065 0.0314793 0.0012593 0.34243 0.1942306 -0.0776929 0.0231229 -0.0501747 0.2381253 0.0104429 0.0254683 0.0182183 0.3636141 0.1321442 0.0130578 0.0118603 -0.0503422 0.4181577 0.0056669 0.0119916 0.0054835 0.4090169 unknown
polarizability: 132.5620396|5.0924101|146.9195767|-4.1805474|-4.0422663|56.222395 unknown
InChI: InChI=1S/C7H9N3O3/c1-2-3-4(6(11)12)9-7(13)10-5(3)8/h9,11H,2,8H2,1H3
charge 0 multiplicity 1
22 atoms
O  1.516983 -2.714857 -0.117984
O  -3.002329 -1.683627 0.27569
O  2.877869 -0.838404 -0.258789
N  -0.704544 -1.388219 0.047343
N  -2.16882 0.509876 0.016338
N  -1.315867 2.636267 -0.250924
C  0.301632 0.783091 -0.269715
C  1.457823 1.744401 -0.472061
C  0.422616 -0.600498 -0.139513
C  -1.080758 1.281856 -0.16371
C  1.953828 2.378462 0.859653
C  -2.046848 -0.877801 0.120831
C  1.727747 -1.327222 -0.184386
H  2.30628 1.222434 -0.940014
H  1.15114 2.54215 -1.178237
H  2.740088 3.127903 0.658522
H  2.386242 1.600872 1.512376
H  1.136488 2.872892 1.415906
H  -0.592466 -2.403378 0.12569
H  -0.573119 3.318413 -0.366529
H  -2.285409 2.94168 -0.178099
H  2.389723 -3.189288 -0.13749
