program: Gaussian 09
title: 000290719
version: EM64L-G09RevD.01
frameworkgroup: C1[X(C13H13N3O4)]
method: RPBEPBE
basis: SDD
operation: Freq
keyword: #p
keyword: freq=noraman
keyword: PBEPBE/SDD
title: #p freq=noraman PBEPBE/SDD
converged: YES YES NO NO
title: Mulliken charges:
elementType: O O O O N N N C C C C C C C C C C C C C H H H H H H H H H H H H H
charge: -0.317465 -0.307022 -0.201552 -0.233020 -0.432750 -0.034261 -0.608063 0.111219 0.164352 0.099384 0.409401 0.213318 -0.022490 -0.347979 -0.379862 -0.253029 -0.206394 -0.194260 -0.252671 -0.660547 0.369030 0.256884 0.259629 0.232030 0.239693 0.230255 0.231429 0.351143 0.343067 0.231312 0.224603 0.253731 0.230884
chargesum: 0.00000
title: Mulliken charges with hydrogens summed into heavy atoms:
elementType: O O O O N N N C C C C C C C C C C C C C
charge: -0.317465 -0.307022 -0.201552 -0.233020 -0.063720 -0.034261 0.086146 0.111219 0.164352 0.099384 0.409401 0.213318 -0.022490 -0.091095 -0.120232 0.218693 0.023861 0.037169 -0.021359 0.048671
polarizability: 2.30197991e+02 -8.90044945e-01 1.80752762e+02 1.70415001e+01 6.55142174e+00 1.29170161e+02
1716.lowfreq: -9.3350 -4.5017 -0.0003 0.0003 0.0009 3.3608 14.2991 30.4204 38.3163
frequency: 13.8264 30.3712 38.2162 47.9717 53.7059 86.9352 100.0657 123.2644 147.4501 189.7271 200.0832 211.0193 253.8641 272.8810 306.8726 314.0938 331.3416 366.9440 398.7762 409.3749 429.9825 479.7295 490.7553 521.8481 543.1909 550.8266 554.4172 600.9146 609.8373 632.6222 687.3469 690.3600 708.4081 712.5724 724.5287 753.7148 760.7264 772.0740 793.1135 816.4128 829.8553 835.4867 879.7196 901.7389 950.5050 966.6171 986.2523 987.6587 1017.0095 1018.8662 1045.9917 1078.8879 1095.5111 1125.4807 1146.1353 1156.5585 1169.9718 1175.1421 1185.0865 1238.2390 1265.5879 1279.5325 1308.5928 1356.3319 1386.2492 1388.8971 1392.8212 1442.5168 1456.2123 1461.0007 1462.8612 1470.3474 1484.2742 1518.0801 1585.9647 1596.8979 1609.5201 1623.4665 1638.6272 1652.3168 2995.9060 3035.4317 3091.5423 3098.3307 3124.7057 3132.3043 3141.1808 3153.5870 3165.8816 3177.3998 3520.7899 3534.9989 3690.9380
redmass: 4.2510 4.1090 3.8334 5.5827 4.4911 6.3423 6.1215 3.2723 7.1049 4.0666 7.0609 1.3680 4.3414 5.9491 2.9488 5.2146 6.1130 7.5870 7.6343 2.9031 4.0601 3.3000 5.3403 6.7134 1.4372 2.8578 3.5821 1.6238 6.1745 5.4725 2.3703 2.7249 4.4887 4.6345 6.5895 1.8733 1.8604 5.1327 2.3377 1.8152 1.2667 5.3937 3.7851 1.4070 3.4860 1.3717 3.4959 1.5550 3.4664 2.1666 3.7572 1.4985 2.1962 3.7234 2.7733 1.6532 1.1105 1.9853 2.0359 7.1299 1.9323 1.1839 1.3218 1.2795 4.4816 3.9069 1.2306 2.3090 1.7567 1.7470 1.0533 2.3269 1.0527 3.9245 1.8137 6.2640 6.6691 5.8596 6.5198 7.0649 1.0361 1.0598 1.0974 1.1030 1.1067 1.0850 1.0888 1.0937 1.0971 1.0995 1.0771 1.0445 1.1055
irintensity: 0.8899 0.5666 0.1787 4.1278 0.4942 1.0250 0.2972 0.3841 3.8740 1.1705 5.8921 4.0922 0.5960 2.2437 15.6554 7.7689 17.2971 0.3782 3.5258 0.0846 1.0477 16.7651 36.0006 0.7835 150.7586 13.1209 4.5033 60.3403 1.5314 10.8517 23.2609 31.4340 4.3499 5.7467 4.8260 74.1090 82.3150 32.0828 24.0135 11.4209 1.0010 16.0665 8.3628 4.7438 30.6745 0.3493 2.5246 1.5287 137.4914 23.7213 37.9004 12.0120 52.1471 290.3056 78.9234 28.8813 7.7570 133.6957 132.4590 145.5064 213.4836 12.5761 0.1804 5.5394 21.9587 19.1471 21.2438 5.4942 70.4290 89.8882 7.8557 90.2535 12.9962 148.5046 189.6243 53.2001 17.1990 523.4604 159.2019 375.0201 14.9759 28.5601 31.5578 1.3205 24.9599 1.8880 7.9557 22.0283 18.1365 6.6186 132.9727 89.5311 63.1224
temp: 298.150 k
press: 1.00000 atm
elementType: 8 8 8 8 7 7 7 6 6 6 6 6 6 6 6 6 6 6 6 6 1 1 1 1 1 1 1 1 1 1 1 1 1
symmnumber: 1
zpe: 650553.0 jmol-1
zpe.correction: 0.247783 hartree
zpe.thermalcorrener: 0.266324 hartree
zpe.thermalcorrenthalpy: 0.267268 hartree
zpe.thermalcorrgfe: 0.198422 hartree
zpe.sumelectzpe: -966.898827 hartree
zpe.sumelectthermal: -966.880286 hartree
zpe.sumelectthermalent: -966.879341 hartree
zpe.sumelectthermalfe: -966.948188 hartree
dipole: -5.6915 2.9757 -0.8496
dipole: 6.4785
quadrupole: -137.3394 -94.1147 -113.8096
quadrupole: 17.4719 -9.6139 6.3408
quadrupole: -22.2515 20.9732 1.2783 17.4719 -9.6139 6.3408
hfenergy: -967.1466093 hartree
pointgroup: C01 [X(C13H13N3O4)]
dipole: -1.0546096 2.3187794 -0.0869545 debye
polarizability: 211.3188532|-25.7264178|200.5108801|13.4709249|2.2728853|128.2911808 unknown
InChI: InChI=1S/C13H13N3O4/c1-2-19-12(17)9-10(11(14)16-13(18)15-9)20-8-6-4-3-5-7-8/h3-7,15H,2,14H2,1H3
charge 0 multiplicity 1
33 atoms
O  -1.215081 -0.496297 -1.099248
O  2.883437 0.874558 -0.242595
O  0.791324 1.615576 -0.988615
O  2.923487 -3.74397 0.563604
N  2.14905 -1.624541 -0.010811
N  0.677656 -3.529618 -0.135536
N  -1.533232 -3.193255 -0.820859
C  -0.114517 -1.238259 -0.642015
C  1.159593 -0.736609 -0.404391
C  -0.296044 -2.686924 -0.520463
C  -1.865522 0.443041 -0.232874
C  1.537782 0.699352 -0.580132
C  1.955542 -3.043499 0.166517
C  -1.733457 0.403149 1.1708
C  -2.703326 1.375674 -0.874854
C  3.429835 2.264913 -0.363606
C  -2.46578 1.332493 1.94504
C  -3.430392 2.292851 -0.086385
C  -3.314357 2.277251 1.324417
C  3.143287 3.069467 0.906031
H  3.086607 -1.254962 0.174289
H  -1.08381 -0.333798 1.654282
H  -2.760016 1.382126 -1.966931
H  4.507254 2.102259 -0.522583
H  2.977371 2.735382 -1.253854
H  -2.374113 1.309548 3.036543
H  -4.080788 3.025842 -0.575793
H  -2.270992 -2.576586 -1.155661
H  -1.673674 -4.199138 -0.748627
H  -3.878226 2.992905 1.93166
H  3.628385 4.060094 0.829702
H  2.060013 3.227905 1.037545
H  3.544504 2.558172 1.797705
