program: Gaussian 09
title: 000290716
version: EM64L-G09RevD.01
frameworkgroup: C1[X(C10H13N3O4)]
method: RPBEPBE
basis: SDD
operation: Freq
keyword: #p
keyword: freq=noraman
keyword: PBEPBE/SDD
title: #p freq=noraman PBEPBE/SDD
converged: NO YES NO NO
title: Mulliken charges:
elementType: O O O O N N N C C C C C C C C C C H H H H H H H H H H H H H
charge: -0.252985 -0.478484 -0.250196 -0.242049 -0.134966 -0.410634 -0.392263 -0.392987 -0.397142 -0.393491 -0.390998 -0.406812 0.215947 0.148770 0.155343 0.111147 0.137040 0.256497 0.222083 0.262541 0.220711 0.205283 0.207648 0.231743 0.202132 0.224546 0.195084 0.387525 0.364398 0.394569
chargesum: 0.00000
title: Mulliken charges with hydrogens summed into heavy atoms:
elementType: O O O O N N N C C C C C C C C C C
charge: -0.252985 -0.083915 -0.250196 -0.242049 -0.134966 -0.023110 -0.027865 0.085594 0.086109 0.019440 0.042876 0.012818 0.215947 0.148770 0.155343 0.111147 0.137040
polarizability: 2.10959822e+02 1.11939475e+01 1.59317018e+02 9.20197116e+00 -1.90483732e-01 8.83590742e+01
1716.lowfreq: -14.2089 -9.7999 -3.6601 0.0004 0.0005 0.0005 46.8653 55.0116 67.3943
frequency: 46.7265 54.9415 67.2357 103.9555 126.4450 161.0091 166.0941 191.4039 230.8962 245.2253 296.1398 311.1935 341.6163 378.6164 398.7107 409.2607 430.9116 442.1888 464.4674 486.7541 530.9751 562.8543 566.2042 619.6250 649.6954 665.0485 693.1917 707.4018 721.4442 751.2868 783.1861 796.6738 829.4893 847.7133 885.2598 910.2223 924.7280 941.8931 983.4414 1011.1997 1046.7594 1054.1887 1089.8546 1115.1063 1132.0142 1151.0808 1164.7768 1226.2518 1234.0771 1239.2556 1258.4572 1272.5466 1306.7266 1328.8321 1335.8712 1343.0816 1348.5197 1353.3321 1364.0237 1374.4739 1405.3107 1447.8556 1455.8383 1460.2567 1464.3881 1467.0613 1472.7034 1570.2752 1608.0313 1630.7945 1682.9587 2945.4231 2972.8223 2982.8644 2985.0568 2997.5997 3039.5771 3047.1334 3061.1714 3065.1602 3118.8878 3524.4563 3537.0218 3559.2843
redmass: 4.9561 6.5983 3.9957 5.5210 6.7754 6.9949 3.8929 7.0461 2.6094 3.2020 4.5909 3.1266 9.8685 2.4528 5.7005 5.2344 5.5204 3.0285 3.0302 3.7266 5.5705 1.4030 2.4277 4.4042 4.9614 2.3698 3.9060 4.2251 1.9486 3.3614 2.0116 1.4868 2.9624 1.4769 5.0314 2.9254 4.1806 1.3583 3.5213 2.5342 2.7016 2.0681 1.4524 2.9056 2.2573 1.2528 2.0529 2.8900 2.4562 1.9373 1.2932 1.1765 3.4555 1.2896 1.3935 1.5096 1.7128 1.4763 1.6194 2.2221 2.2120 1.1155 1.1068 1.1750 1.2138 2.0615 1.1169 7.5963 6.5673 8.4671 5.6932 1.0714 1.0630 1.0631 1.0614 1.0614 1.0968 1.1009 1.1018 1.1024 1.0917 1.0769 1.0776 1.0650
irintensity: 0.4447 1.0409 1.2181 1.9476 0.8705 3.2964 3.4870 0.5072 4.1702 0.9334 2.3967 0.7902 10.2567 4.5611 10.5666 11.2519 16.5971 5.7271 7.3102 16.1236 2.6778 130.8186 12.0428 24.6838 2.6819 23.5617 14.2452 16.7917 1.8201 73.8267 156.3300 0.5126 7.3664 28.2127 51.5990 14.3954 39.3333 11.5139 82.6827 25.0288 382.6412 1.3989 75.1221 9.9153 5.1045 3.9450 42.7421 22.7709 69.4162 29.7639 5.0885 22.8529 185.6682 3.0646 5.7977 14.2165 23.7405 9.7090 13.2419 62.9639 36.6671 18.4870 8.2398 17.6042 23.3066 20.3655 0.8160 275.6831 171.3999 221.2329 838.7805 42.2489 40.4495 9.2588 30.3568 32.4908 58.5420 35.4435 5.8082 71.1022 3.3680 69.5375 120.2343 88.7790
temp: 298.150 k
press: 1.00000 atm
elementType: 8 8 8 8 7 7 7 6 6 6 6 6 6 6 6 6 6 1 1 1 1 1 1 1 1 1 1 1 1 1
symmnumber: 1
zpe: 615936.2 jmol-1
zpe.correction: 0.234598 hartree
zpe.thermalcorrener: 0.249656 hartree
zpe.thermalcorrenthalpy: 0.250601 hartree
zpe.thermalcorrgfe: 0.192338 hartree
zpe.sumelectzpe: -852.784857 hartree
zpe.sumelectthermal: -852.769799 hartree
zpe.sumelectthermalent: -852.768854 hartree
zpe.sumelectthermalfe: -852.827117 hartree
dipole: -3.1684 2.9672 0.2467
dipole: 4.3478
quadrupole: -107.5752 -98.4733 -98.9863
quadrupole: 8.2194 -4.6133 2.4599
quadrupole: -5.8969 3.2050 2.6919 8.2194 -4.6133 2.4599
hfenergy: -853.019455 hartree
pointgroup: C01 [X(C10H13N3O4)]
dipole: -1.278957 1.1151177 0.2164106 debye
polarizability: 209.8460504|10.8600039|158.6292236|13.5221219|9.5970639|90.16064 unknown
InChI: InChI=1S/C10H13N3O4/c14-8-7(13-4-2-1-3-5-13)6(9(15)16)11-10(17)12-8/h11-12,15H,1-5H2
charge 0 multiplicity 1
30 atoms
O  -0.148308 -2.621095 -0.737239
O  2.064016 2.896931 0.354434
O  4.138583 -1.269136 0.496685
O  -0.089997 2.790928 -0.536328
N  -1.225421 0.011251 -0.205351
N  2.446929 0.351616 0.371533
N  1.971046 -1.862531 -0.189629
C  -1.849807 0.986571 0.718824
C  -2.142901 -0.543902 -1.242654
C  -3.108819 0.372317 1.375475
C  -3.405341 -1.164809 -0.614186
C  -4.106959 -0.153374 0.320189
C  0.136727 -0.233034 -0.210635
C  1.119993 0.738711 0.070474
C  0.597945 -1.64813 -0.420868
C  2.947799 -0.936888 0.251342
C  0.906473 2.185244 -0.06268
H  -2.097789 1.9211 0.177585
H  -1.109766 1.251256 1.494095
H  -1.60159 -1.293497 -1.835026
H  -2.429404 0.299061 -1.909074
H  -3.580124 1.148587 2.008543
H  -2.80299 -0.45802 2.041577
H  -3.111682 -2.069894 -0.050218
H  -4.085438 -1.485066 -1.426206
H  -4.977802 -0.62193 0.815322
H  -4.49423 0.696986 -0.27831
H  3.106086 1.092277 0.625727
H  2.296287 -2.829898 -0.287158
H  1.925686 3.864267 0.180457
