program: Gaussian 09
title: 000290707
version: EM64L-G09RevD.01
frameworkgroup: C1[X(C8H11N3O3)]
method: RPBEPBE
basis: SDD
operation: Freq
keyword: #p
keyword: freq=noraman
keyword: PBEPBE/SDD
title: #p freq=noraman PBEPBE/SDD
converged: NO YES NO NO
title: Mulliken charges:
elementType: O O O N N N C C C C C C C C H H H H H H H H H H H
charge: -0.175804 -0.316124 -0.203824 -0.386075 -0.442582 -0.049655 0.002967 0.377720 0.131908 -0.777006 0.239339 0.198821 -0.796885 -0.788517 0.336631 0.400151 0.233761 0.233734 0.275817 0.243865 0.275159 0.242909 0.241622 0.260729 0.241340
chargesum: 0.00000
title: Mulliken charges with hydrogens summed into heavy atoms:
elementType: O O O N N N C C C C C C C C
charge: -0.175804 -0.316124 -0.203824 -0.049445 -0.042431 -0.049655 0.002967 0.377720 0.131908 -0.033694 0.239339 0.198821 -0.034952 -0.044825
polarizability: 1.69253630e+02 -4.54766236e+00 1.44454617e+02 3.68869252e-02 1.09671895e-02 6.36049891e+01
1716.lowfreq: -106.8288 -44.9082 -23.5602 -7.4693 -0.0011 -0.0008 -0.0005 1.6276 8.5113
frequency: -106.8222 -44.8943 -23.4702 75.4613 80.6399 107.4156 107.5252 158.6695 169.2215 191.5353 230.5493 255.2995 326.5640 334.3536 362.1042 366.0677 459.7346 538.7957 570.5125 571.7617 578.8157 589.0068 621.6705 649.1589 694.6971 764.4316 766.0364 834.8181 902.6617 925.5973 976.7733 982.9983 986.9983 999.7065 1032.6354 1035.3445 1045.4184 1059.5630 1131.1213 1226.2674 1267.8584 1343.7481 1380.3905 1382.7784 1399.9912 1420.0461 1435.2267 1448.2062 1453.1781 1464.9413 1467.9398 1473.7014 1485.3076 1501.4375 1535.3961 1616.6392 1640.4948 1659.0992 2978.0720 2991.7887 2992.5704 3055.7340 3075.7288 3077.4963 3098.3252 3107.5257 3138.4215 3139.9041 3522.7075
redmass: 1.0579 1.0468 5.8480 3.3745 6.4732 4.5410 3.6170 1.0999 3.6327 3.8244 6.9680 4.9842 3.5271 4.9108 4.0949 6.9862 5.4266 4.1134 3.5690 3.2768 4.2297 5.5613 1.2161 5.4185 7.4631 7.4323 6.7718 7.1140 6.1591 6.2036 1.8393 1.1036 1.6033 1.6969 1.6161 1.6299 1.4813 4.3117 4.3521 4.2614 2.6811 4.2013 1.2401 1.2406 1.2421 2.4206 2.0979 1.1835 1.3506 1.0462 1.0460 1.0439 1.7319 1.8760 2.4576 4.2151 7.9687 3.4510 1.0385 1.0389 1.0380 1.0989 1.0984 1.0979 1.0851 1.0961 1.0990 1.0977 1.0766
irintensity: 0.0229 0.7447 4.5878 9.6415 4.1639 5.6894 0.8039 0.1309 1.0887 1.6436 4.4423 4.7118 0.3003 1.4740 2.8256 0.0686 6.1304 18.0833 0.0285 0.0109 15.5603 4.1341 79.2439 18.4637 0.0554 1.7959 0.7914 8.9064 5.3694 9.4879 37.8502 80.3550 15.4552 2.6973 11.9467 19.5097 2.8620 15.6895 4.4606 145.4517 25.9414 78.6298 57.1615 47.0523 13.9603 372.7779 29.1739 85.5927 0.7470 19.3649 16.5263 23.8280 12.7888 218.8857 271.5594 109.2891 449.5768 36.1723 20.8079 9.3489 4.6511 17.0039 11.4773 13.5841 402.7251 10.5958 9.3773 5.0890 27.6921
temp: 298.150 k
press: 1.00000 atm
elementType: 8 8 8 7 7 7 6 6 6 6 6 6 6 6 1 1 1 1 1 1 1 1 1 1 1
symmnumber: 1
zpe: 498032.8 jmol-1
zpe.correction: 0.189691 hartree
zpe.thermalcorrener: 0.202103 hartree
zpe.thermalcorrenthalpy: 0.203048 hartree
zpe.thermalcorrgfe: 0.150686 hartree
zpe.sumelectzpe: -700.312725 hartree
zpe.sumelectthermal: -700.300312 hartree
zpe.sumelectthermalent: -700.299368 hartree
zpe.sumelectthermalfe: -700.351730 hartree
dipole: 7.5023 5.2350 0.0174
dipole: 9.1483
quadrupole: -69.8536 -92.3457 -81.9755
quadrupole: -8.7476 0.0054 0.0306
quadrupole: 11.5380 -10.9541 -0.5839 -8.7476 0.0054 0.0306
hfenergy: -700.5024156 hartree
pointgroup: C01 [X(C8H11N3O3)]
dipole: 2.795537 -2.2669776 -0.0068569 debye
dipolederiv: -0.3278656 0.0133961 0.0001685 -0.0759897 -0.5663309 0.0001148 -0.0000564 -0.000226 -0.1108687 -0.8955894 -0.4729449 0.0017399 0.1790463 -0.8238647 0.0003925 0.000306 0.0023159 -0.339188 -0.9808121 0.0643893 -0.0000147 0.6458708 -0.7446453 -0.0002963 -0.0003655 -0.0003373 -0.3130174 -0.2835928 -0.2007276 -0.0000455 0.2211215 -1.1021001 0.0005687 -0.0002477 0.0011629 -0.2451408 -2.188181 -0.0441013 -0.0005129 -0.2165195 -0.6042315 0.0001372 -0.0002777 -0.0002053 -0.2809708 -0.0348462 0.2239708 -0.0002457 -0.1609513 -0.3362779 -0.0001038 0.0001251 0.0000149 -0.1859311 -0.5333716 -0.3721287 0.0002875 -0.4616416 0.0587508 -0.000025 0.0004604 -0.0001726 -0.0636675 1.2677919 0.0403921 0.0001079 0.5221717 0.4922565 0.0002251 -0.0001675 0.0001431 0.182362 0.3663037 0.1595619 -0.0001954 0.4156349 0.520628 -0.0000427 -0.000435 0.0000604 0.0013331 -0.0827101 -0.0398345 0.0000435 -0.0321694 -0.0207296 -0.0000124 0.000046 0.0000117 0.1004349 0.9378853 0.5583273 -0.0032609 -0.0978018 1.6013051 -0.0008764 -0.0039014 -0.0000096 0.1693175 2.3825192 0.0389491 0.0007721 -0.534697 1.0107302 0.0008647 0.0019415 0.0014494 0.1710077 -0.2644021 0.2729395 0.0017347 0.154036 -0.1943066 0.0002301 0.0047162 -0.004024 0.0432814 -0.1868032 -0.1538229 -0.0001032 -0.3076748 -0.3049332 -0.0010753 -0.0022755 -0.002369 0.0488326 0.1309417 0.0457725 0.0002379 -0.0139918 0.2094889 0.0001829 0.0001556 0.0000971 0.2927949 0.4121652 -0.18598 0.0001045 -0.3155595 0.4435278 -0.0001231 0.0011938 -0.0007026 0.2982305 -0.0093841 0.0031267 -0.0493137 0.0649663 0.0852777 0.0999294 -0.0918017 0.0718053 -0.0346321 -0.0092943 0.0030114 0.0492992 0.0647983 0.0853664 -0.0999206 0.0918563 -0.0717505 -0.0349424 0.117069 0.0257773 0.0000148 -0.0734589 -0.0628365 -0.0000433 -0.000014 -0.0001082 0.1322439 0.027548 0.0341472 0.0870783 0.0002457 0.0611023 0.0581633 0.1070831 0.0079719 -0.0239582 0.0719187 -0.0956991 0.0014564 -0.0252687 -0.0262605 0.0018707 0.0000348 0.0032198 0.1352442 0.0229544 0.0319796 -0.0892403 -0.0038767 0.0602486 -0.0605462 -0.1093478 -0.0096826 -0.0190777 0.0739794 0.0179343 0.0715615 -0.0124423 0.0382333 -0.0778305 0.0316493 -0.1002672 -0.0281391 -0.0871934 0.0112562 0.0014601 0.0748181 0.0836602 -0.0006848 0.0021661 0.0001252 0.1291793 0.0729693 0.0203077 -0.0731347 -0.0106667 0.0359411 0.0789011 -0.032844 0.1014772 -0.0247283 unknown
polarizability: 169.7786216|2.7177816|143.9296249|-0.0360006|0.0135971|63.6049891 unknown
InChI: InChI=1S/C8H11N3O3/c1-4-7(9-5(2)12)8(14-11-4)10-6(3)13/h9-10H,1-3H3
charge 0 multiplicity 1
25 atoms
O  -0.58885 1.98263 0.001427
O  0.071989 -2.485682 0.005449
O  -3.293514 1.212964 0.000889
N  1.752368 -0.86013 0.000143
N  -1.457938 -0.267047 0.000972
N  0.731352 2.658322 0.000881
C  0.999077 0.348543 0.000447
C  -0.383366 0.603975 0.000876
C  1.62616 1.643581 0.0003
C  3.098016 1.95316 -0.000311
C  1.309013 -2.169057 0.001989
C  -2.83522 0.042128 0.000719
C  2.406612 -3.225082 -0.000619
C  -3.707798 -1.211161 -0.000801
H  2.76633 -0.723835 -0.001656
H  -1.141808 -1.266514 0.000685
H  3.601032 1.545895 0.897276
H  3.600141 1.546692 -0.898765
H  3.243407 3.04517 0.000084
H  3.039802 -3.148443 -0.903568
H  1.934394 -4.217228 0.012835
H  3.0603 -3.133344 0.886126
H  -3.515991 -1.827474 -0.898305
H  -4.763684 -0.905619 0.007585
H  -3.50452 -1.83904 0.88604
