program: Gaussian 09
title: 000290669
version: EM64L-G09RevD.01
frameworkgroup: C1[X(C13H13NO5)]
method: RPBEPBE
basis: SDD
operation: Freq
keyword: #p
keyword: freq=noraman
keyword: PBEPBE/SDD
title: #p freq=noraman PBEPBE/SDD
converged: YES YES NO NO
title: Mulliken charges:
elementType: O O O O O N C C C C C C C C C C C C C H H H H H H H H H H H H H
charge: -0.211931 -0.428341 -0.231377 -0.184118 -0.264231 -0.434728 0.159571 -0.339617 0.171682 -0.684104 0.103288 0.170849 0.503650 -0.467081 -0.302760 -0.323435 -0.367809 0.324280 -0.537659 0.268735 0.242895 0.237818 0.241718 0.332496 0.230004 0.218539 0.244447 0.251182 0.386735 0.246972 0.221347 0.220982
chargesum: 0.00000
title: Mulliken charges with hydrogens summed into heavy atoms:
elementType: O O O O O N C C C C C C C C C C C C C
charge: -0.211931 -0.041606 -0.231377 -0.184118 -0.264231 -0.102231 0.159571 -0.070882 0.171682 0.038327 0.103288 0.170849 0.503650 -0.237077 -0.084220 -0.078987 -0.116628 0.324280 0.151642
polarizability: 2.92445086e+02 -1.18538480e+01 1.69976782e+02 5.45678266e+00 -1.06127774e+01 9.76126432e+01
1716.lowfreq: -4.9879 -1.8989 -0.0009 -0.0005 0.0005 6.7791 14.2464 31.0133 44.0154
frequency: 13.9966 30.9812 44.0049 61.0126 86.7406 89.7083 116.6901 162.2693 186.6570 201.2445 219.0915 233.4758 244.6278 249.3441 310.3921 340.2401 358.3910 369.0604 385.7974 412.7649 428.9424 443.4844 512.4679 518.8922 556.6007 576.5800 583.4727 615.2901 623.4781 665.8599 681.0264 709.3225 719.5174 734.2070 735.7380 747.8933 783.5194 797.5606 816.8068 829.8039 845.3637 895.4684 923.6639 940.6546 950.9697 987.3397 998.5130 1011.8846 1061.8329 1103.8032 1112.5962 1124.9849 1144.8145 1158.1884 1178.9604 1182.9276 1226.6688 1233.3777 1243.8232 1284.4042 1309.3726 1314.7956 1380.6520 1387.2154 1430.6135 1437.7389 1459.3473 1467.0149 1468.9930 1472.7309 1504.9870 1535.1558 1594.1726 1632.6066 1668.0422 1674.2710 1693.5362 2957.6941 3006.8585 3044.8715 3110.4348 3122.1047 3123.2064 3126.2295 3162.6920 3166.4462 3205.5438 3246.0317 3452.4491 3518.3553
redmass: 3.6312 6.6407 8.7419 5.8040 5.3757 4.7060 5.2831 3.9560 3.3731 6.0070 1.2047 1.3988 2.2397 4.3685 3.5302 4.1716 5.8361 6.6087 6.1554 2.9434 5.0481 4.1726 4.5313 2.2811 4.5562 4.6507 1.5516 4.6381 4.9035 5.5427 1.1724 4.0550 3.3532 2.9221 7.4280 2.6156 7.5516 1.2700 1.8060 4.8968 3.8590 3.7933 1.4021 1.3714 1.7810 7.2355 2.8564 2.7750 4.8048 3.5220 1.2594 1.3629 1.8999 1.3509 2.8442 1.2629 3.2531 3.0319 2.0842 2.2193 2.2541 1.4857 6.1113 1.2008 3.5588 1.1954 1.0522 1.0501 1.0524 1.0726 2.2517 2.1451 4.4572 6.5002 10.1795 9.9577 10.1748 1.0332 1.0348 1.1040 1.1012 1.0899 1.1007 1.0989 1.0905 1.0936 1.0932 1.0959 1.0752 1.0642
irintensity: 2.3023 0.3859 0.7033 0.7276 1.4044 2.8784 5.5693 0.9701 0.6191 5.9738 0.8782 0.7986 1.1708 0.7290 2.5234 3.9927 4.2750 6.6113 1.3435 0.0305 3.3278 0.4995 40.2457 28.7392 8.5574 5.9134 95.9616 44.9142 18.5494 17.6909 53.4436 38.4897 1.0808 31.5601 6.0703 39.1720 0.3027 0.1968 113.6566 5.6763 1.7706 29.9525 0.2624 2.0637 10.5352 48.9625 24.6590 374.8594 76.1175 48.0722 0.1778 23.7170 16.2281 2.8960 23.6411 66.8612 344.1412 47.0457 4.7650 18.5588 1.1473 2.7951 19.8959 12.2738 0.5081 13.9944 9.9510 14.4351 12.0105 78.8966 198.2482 199.9831 13.3603 22.6009 355.4510 299.3742 426.4698 88.0030 15.1536 50.0149 20.5976 19.5538 8.2388 18.6014 4.8632 15.9872 9.8696 15.8490 56.2510 36.4197
temp: 298.150 k
press: 1.00000 atm
elementType: 8 8 8 8 8 7 6 6 6 6 6 6 6 6 6 6 6 6 6 1 1 1 1 1 1 1 1 1 1 1 1 1
symmnumber: 1
zpe: 630918.6 jmol-1
zpe.correction: 0.240304 hartree
zpe.thermalcorrener: 0.258247 hartree
zpe.thermalcorrenthalpy: 0.259191 hartree
zpe.thermalcorrgfe: 0.192321 hartree
zpe.sumelectzpe: -932.657416 hartree
zpe.sumelectthermal: -932.639473 hartree
zpe.sumelectthermalent: -932.638529 hartree
zpe.sumelectthermalfe: -932.705399 hartree
dipole: -4.2567 -3.0743 1.5911
dipole: 5.4866
quadrupole: -93.9569 -110.5461 -114.7328
quadrupole: -25.6694 8.5660 3.1552
quadrupole: 12.4550 -4.1341 -8.3209 -25.6694 8.5660 3.1552
hfenergy: -932.8977201 hartree
pointgroup: C01 [X(C13H13N1O5)]
dipole: 1.6798189 1.1872375 0.6543464 debye
polarizability: 292.1756166|-14.0258922|170.5210883|-0.9955234|9.9043136|97.3378061 unknown
InChI: InChI=1S/C13H13NO5/c1-13(12(16)17)7-10(11(15)19-13)14-8-3-5-9(18-2)6-4-8/h3-7,14,16H,1-2H3
charge 0 multiplicity 1
32 atoms
O  -3.410588 -1.088212 0.28197
O  -3.763717 2.499485 -0.403036
O  -2.066791 -2.953915 -0.172191
O  -4.008037 0.663169 -1.811798
O  5.321669 1.121114 0.24462
N  0.18774 -1.257965 0.053756
C  -3.147293 0.361913 0.523605
C  -1.626758 0.491355 0.508321
C  -1.075005 -0.732453 0.211781
C  -3.8274 0.757313 1.842793
C  -2.184771 -1.737171 0.066069
C  -3.704184 1.12817 -0.700331
C  1.458345 -0.639352 0.106809
C  2.604512 -1.471482 0.011981
C  1.646503 0.764731 0.238488
C  3.905366 -0.932056 0.05045
C  2.942986 1.306258 0.279341
C  4.080096 0.467946 0.188956
C  6.524158 0.290235 0.15415
H  -1.158637 1.450857 0.707477
H  -4.909968 0.550768 1.793921
H  -3.388331 0.17236 2.667756
H  -3.680101 1.831681 2.036761
H  0.175183 -2.269913 -0.126827
H  2.478279 -2.556382 -0.0917
H  0.79568 1.44448 0.292115
H  4.762926 -1.606521 -0.025968
H  3.095684 2.385128 0.378337
H  -4.068382 2.995505 -1.210397
H  7.365962 0.994831 0.219818
H  6.567638 -0.252811 -0.810285
H  6.57814 -0.433669 0.990861
