program: Gaussian 09
title: 000290664
version: EM64L-G09RevD.01
frameworkgroup: C1[X(C8H8Br4)]
method: RPBEPBE
basis: SDD
operation: Freq
keyword: #pfreq=noraman
keyword: PBEPBE/SDD
title: #p freq=noraman PBEPBE/SDD
converged: NO YES NO NO
title: Mulliken charges:
elementType: Br Br Br Br C C C C C C C C H H H H H H H H
charge: 0.062850 0.076899 0.076878 0.062857 -0.112553 -0.112547 -0.112447 -0.112454 -0.515979 -0.515949 -0.474623 -0.474622 0.287939 0.287942 0.287893 0.287890 0.250009 0.250004 0.250006 0.250007
chargesum: 0.00000
title: Mulliken charges with hydrogens summed into heavy atoms:
elementType: Br Br Br Br C C C C C C C C
charge: 0.062850 0.076899 0.076878 0.062857 0.175386 0.175395 0.175446 0.175436 -0.515979 -0.515949 0.025390 0.025391
polarizability: 1.87215915e+02 1.46763825e+01 1.53080887e+02 -1.14623689e-03 -1.65004078e-04 9.38977663e+01
1716.lowfreq: -19.6434 -7.4226 -0.0004 -0.0003 0.0001 2.6186 22.8327 60.1260 86.9675
frequency: 22.8326 60.1260 86.9663 108.2922 128.7326 137.1876 163.8253 174.0175 184.5243 238.0026 298.3593 378.2122 379.5732 425.2206 450.6488 489.0201 518.1797 664.9977 674.6025 720.5991 744.3959 793.6535 841.1868 864.6667 911.1424 930.4223 944.3672 985.6165 1010.6285 1036.9405 1075.6757 1083.9676 1090.4517 1170.4318 1224.8938 1240.2982 1253.3295 1256.6588 1305.3085 1307.9854 1331.9293 1335.3135 1379.2928 1383.3431 1456.7067 1462.4123 3001.7115 3001.8576 3054.5902 3055.0655 3124.0059 3125.0113 3135.7323 3137.3167
redmass: 11.9097 67.8919 39.3201 7.1895 3.9578 40.4100 25.0284 3.8577 43.6473 3.1057 5.8786 3.2743 6.2523 2.3502 4.0433 5.6903 6.9596 3.0320 5.2594 3.5259 3.5200 4.3519 3.0600 6.2393 2.5548 5.2210 1.7653 1.5819 2.8259 1.3830 2.2218 1.2240 1.6445 1.6465 1.3487 1.1395 1.0983 1.1975 3.5247 1.5172 1.4032 1.5531 1.8987 2.8600 1.0710 1.1107 1.0602 1.0599 1.1016 1.1017 1.0873 1.0887 1.0902 1.0918
irintensity: 0.7914 0.0276 0.0000 1.4742 0.0000 0.0000 0.0690 1.0501 0.0000 0.0000 29.6330 14.5215 0.0050 0.0000 1.9875 0.0000 0.0000 181.3416 0.0015 0.0000 11.6665 4.2922 0.0001 4.0483 71.8482 0.0000 0.0000 12.4927 0.1706 0.0000 53.7784 5.5538 0.0000 0.0000 0.0001 1.2087 8.5867 0.0000 30.1451 0.0000 7.8101 0.0010 3.6069 0.0000 29.9070 0.0000 44.7497 0.0016 0.0001 17.8517 0.0005 2.9438 9.2080 0.0005
temp: 298.150 k
press: 1.00000 atm
elementType: 35 35 35 35 6 6 6 6 6 6 6 6 1 1 1 1 1 1 1 1
symmnumber: 1
zpe: 361034.4 jmol-1
zpe.correction: 0.137511 hartree
zpe.thermalcorrener: 0.150399 hartree
zpe.thermalcorrenthalpy: 0.151343 hartree
zpe.thermalcorrgfe: 0.093922 hartree
zpe.sumelectzpe: -362.508383 hartree
zpe.sumelectthermal: -362.495495 hartree
zpe.sumelectthermalent: -362.494551 hartree
zpe.sumelectthermalfe: -362.551972 hartree
dipole: -0.0004 -0.0015 0.0000
dipole: 0.0015
quadrupole: -125.7070 -104.9114 -103.9851
quadrupole: 3.8981 -0.0001 0.0001
quadrupole: -14.1725 6.6231 7.5494 3.8981 -0.0001 0.0001
hfenergy: -362.6458937 hartree
pointgroup: C01 [X(C8H8Br4)]
dipole: 0.0001742 -0.0005768 0.0000002 debye
dipolederiv: -0.178292 0.0440314 -0.0000415 -0.0537119 -0.6751512 0.0004553 0.0000836 0.0004861 -0.0646426 -0.7703292 0.2152604 -0.0001778 0.2952036 -0.2498695 0.000131 -0.000253 0.0001355 -0.0789843 -0.7700859 0.2152692 -0.0001853 0.2948125 -0.2496286 0.0001315 -0.0002042 0.000149 -0.0790178 -0.17819 0.0443846 -0.0000432 -0.0532559 -0.6751002 0.0004549 0.000096 0.0004845 -0.0646165 -0.0846105 0.023072 -0.0848028 -0.022491 -0.0748045 -0.0878669 0.0464031 0.020656 -0.0863077 -0.0846455 0.0231769 0.0847623 -0.0225242 -0.0746855 0.0878395 -0.046375 -0.0206808 -0.0864046 -0.0846511 0.023129 0.0847039 -0.0226263 -0.0747211 0.0879753 -0.0464959 -0.020677 -0.0863488 -0.0844652 0.0230687 -0.0847446 -0.0225455 -0.0748154 -0.0880007 0.0467085 0.0207322 -0.0862539 0.9316036 -0.3550911 0.000297 -0.2725678 1.0128916 -0.0006568 0.0001421 -0.0007227 0.1353711 0.9311385 -0.3555542 0.0003077 -0.2725801 1.0124377 -0.0006574 0.0000908 -0.0007253 0.1353183 0.1656827 0.1284179 -0.0000881 -0.066529 0.0946747 -0.000044 0.0001042 0.000027 0.0856018 0.1654203 0.1283106 -0.0001003 -0.0664461 0.0947141 0.0000149 -0.0001491 -0.0000757 0.0856006 0.0272738 0.0068536 -0.0072966 0.0713408 -0.0254003 -0.0558276 -0.0163968 -0.0180403 0.0386924 0.027297 0.0068855 0.0072829 0.0713062 -0.0253287 0.0559345 0.0163311 0.0181603 0.0385851 0.0271977 0.0069834 0.0071925 0.0714457 -0.025239 0.0559758 0.0162161 0.0181729 0.0385764 0.0271471 0.0069523 -0.0072065 0.0713784 -0.0253678 -0.05587 -0.0164007 -0.0181074 0.0386834 -0.016846 -0.0462924 -0.062248 -0.0000284 0.0088088 -0.123595 -0.0595496 -0.0487429 0.0090252 -0.0169578 -0.0463045 0.0623199 -0.0001066 0.0088775 0.1235617 0.0596074 0.0487135 0.0090481 -0.0168834 -0.0463671 -0.0622489 -0.0001331 0.0086481 -0.123555 -0.0595542 -0.0486995 0.0092828 -0.0168041 -0.0461863 0.0623174 0.0000587 0.0090593 0.1235988 0.0595958 0.0487545 0.008791 unknown
polarizability: 188.8236027|-12.5671372|151.473165|0.0116291|-0.0441055|93.8978002 unknown
InChI: InChI=1S/C8H8Br4/c9-7(10)3-1-4-6(2-5(3)7)8(4,11)12/h3-6H,1-2H2
charge 0 multiplicity 1
20 atoms
Br -2.223847 -1.917971 0.001352
Br -4.025672 0.845273 -0.000803
Br 3.9638 -0.663128 0.000612
Br 2.160285 2.098999 -0.001542
C  -1.105969 0.820492 0.781659
C  -1.105916 0.819311 -0.783036
C  1.044052 -0.63905 0.78284
C  1.044106 -0.640232 -0.781843
C  -2.180717 0.073575 -0.00016
C  2.118333 0.107432 -0.00003
C  -0.031257 0.09094 1.591892
C  -0.031114 0.088565 -1.592081
H  -1.45569 1.748785 1.245967
H  -1.455621 1.7469 -1.248757
H  1.394422 -1.566353 1.24864
H  1.394491 -1.568238 -1.246231
H  0.464042 0.829432 2.248846
H  -0.526999 -0.647269 2.248842
H  -0.526785 -0.65058 -2.248032
H  0.464255 0.826119 -2.250034
