program: Gaussian 09
title: 000290662
version: EM64L-G09RevD.01
frameworkgroup: C1[X(C10H16O)]
method: RPBEPBE
basis: SDD
operation: Freq
keyword: #pfreq=noraman
keyword: PBEPBE/SDD
title: #p freq=noraman PBEPBE/SDD
converged: YES YES NO NO
title: Mulliken charges:
elementType: O C C C C C C C C C C H H H H H H H H H H H H H H H H
charge: -0.204183 0.361045 -0.533443 -0.527929 -0.542282 -0.419542 -0.444533 0.113135 -0.398731 -0.518867 -0.392830 0.262154 0.211141 0.212759 0.224138 0.213293 0.214561 0.222750 0.197217 0.219669 0.225854 0.206866 0.210390 0.221794 0.244261 0.214454 0.206859
chargesum: 0.00000
title: Mulliken charges with hydrogens summed into heavy atoms:
elementType: O C C C C C C C C C C
charge: -0.204183 0.361045 -0.060148 -0.091032 -0.114428 0.000426 0.000990 0.113135 0.018525 -0.052812 0.028483
polarizability: 1.15742824e+02 1.66334438e+00 9.92469071e+01 -1.96493628e+00 -7.26628237e-01 9.13915009e+01
1716.lowfreq: -25.1999 -0.0007 0.0003 0.0005 12.0706 14.5074 33.3666 71.6163 127.1428
frequency: 27.3444 71.0221 127.0276 185.9317 259.8027 273.1746 303.8721 347.7852 368.5718 420.5968 488.1621 527.8631 538.6917 566.1328 653.1278 692.4558 767.3156 803.9142 838.1041 848.9690 858.7927 899.8611 911.5994 915.1158 938.0897 957.8089 987.3196 1029.3097 1042.4451 1052.1144 1068.3589 1099.2265 1110.6480 1123.0886 1138.2854 1161.8770 1187.6419 1221.0212 1231.5215 1245.8151 1251.1440 1268.1878 1293.4250 1303.4766 1307.4427 1310.8644 1324.6728 1334.2162 1339.3835 1345.6321 1447.1051 1461.0417 1462.0433 1467.0317 1470.1022 1471.3157 1477.3437 1483.2991 1610.9671 2962.8477 2974.3235 2976.2675 2977.6540 2981.1524 2985.7629 2996.6395 3004.0444 3022.0470 3034.5375 3045.9919 3050.8630 3052.7092 3063.5356 3069.7032 3075.8594
redmass: 2.5111 4.7686 2.6290 2.2871 2.1245 2.0474 2.3944 3.4470 2.1030 3.1542 2.0775 3.4749 2.2176 2.6486 3.1482 2.5329 1.7750 1.6029 1.9647 2.4818 2.0109 1.5320 2.3269 1.8932 1.8927 2.1013 1.9606 1.8368 1.5304 1.7264 1.7510 1.5093 1.9665 2.2104 1.9838 1.6442 2.0407 1.4401 1.3864 1.3167 1.3794 1.3870 1.3934 1.3801 1.3971 1.3514 1.4369 1.4843 1.4212 1.4735 1.0862 1.0824 1.0828 1.0852 1.0855 1.0845 1.0895 1.1030 9.9592 1.0602 1.0639 1.0628 1.0658 1.0618 1.0628 1.0615 1.0627 1.0996 1.0993 1.1026 1.0994 1.0965 1.1038 1.0970 1.1043
irintensity: 0.4287 2.5509 0.2891 0.1405 0.1000 0.8569 4.4675 2.3430 1.1129 1.6988 0.8356 3.9233 1.6087 5.2993 1.3182 1.0848 2.4792 12.4811 1.5395 6.7339 1.4653 4.6208 5.3740 7.0076 4.2304 14.8281 2.6556 7.4113 2.0586 1.0346 5.7926 0.0322 0.1096 25.5029 11.7362 1.5236 10.6359 3.3515 2.1049 2.0322 4.1276 9.7853 5.8864 10.5875 1.0339 0.3943 2.8616 4.1409 0.8814 0.1645 14.4280 25.6277 1.4467 15.1567 7.8715 3.3384 6.3970 8.6679 128.2820 27.1866 5.1616 24.2398 35.8924 42.8635 29.9766 37.8872 47.8035 35.4530 54.7844 42.5032 38.8419 29.3075 37.3658 22.4970 52.8344
temp: 298.150 k
press: 1.00000 atm
elementType: 8 6 6 6 6 6 6 6 6 6 6 1 1 1 1 1 1 1 1 1 1 1 1 1 1 1 1
symmnumber: 1
zpe: 627994.2 jmol-1
zpe.correction: 0.239190 hartree
zpe.thermalcorrener: 0.249467 hartree
zpe.thermalcorrenthalpy: 0.250412 hartree
zpe.thermalcorrgfe: 0.202928 hartree
zpe.sumelectzpe: -465.020546 hartree
zpe.sumelectthermal: -465.010269 hartree
zpe.sumelectthermalent: -465.009325 hartree
zpe.sumelectthermalfe: -465.056809 hartree
dipole: -1.0891 -2.8572 1.0938
dipole: 3.2474
quadrupole: -64.2422 -74.8098 -66.8246
quadrupole: -1.0730 0.0225 2.6119
quadrupole: 4.3833 -6.1843 1.8009 -1.0730 0.0225 2.6119
hfenergy: -465.2597366 hartree
pointgroup: C01 [X(C10H16O1)]
dipole: 0.455402 -1.1163004 -0.4228877 debye
polarizability: 115.7907067|-1.2343409|99.1819338|-2.1455924|0.6078651|91.4085917 unknown
InChI: InChI=1S/C10H16O/c11-9-5-1-2-6-10(9)7-3-4-8-10/h1-8H2
charge 0 multiplicity 1
27 atoms
O  -0.027825 2.203978 0.501025
C  -0.255752 -0.243074 0.247303
C  -1.507937 -0.129263 1.184235
C  -0.860173 -0.637098 -1.158115
C  0.765621 -1.305813 0.760383
C  -2.767604 -0.389222 0.30457
C  -2.296918 -0.069885 -1.135575
C  0.466982 1.119242 0.088361
C  2.060162 -1.375568 -0.078283
C  1.821157 1.104393 -0.628954
C  2.767626 -0.002728 -0.092128
H  -1.542194 0.887893 1.612338
H  -1.435842 -0.848886 2.020062
H  -0.894559 -1.743641 -1.224648
H  -0.266194 -0.276203 -2.016464
H  0.257496 -2.290405 0.776821
H  1.033368 -1.067561 1.810728
H  -3.631296 0.223465 0.618021
H  -3.073795 -1.452037 0.366653
H  -2.942367 -0.514826 -1.914396
H  -2.277497 1.025135 -1.294373
H  1.822784 -1.684002 -1.116415
H  2.736393 -2.147275 0.33739
H  1.640862 0.922263 -1.708577
H  2.269205 2.108871 -0.535728
H  3.684006 -0.036196 -0.711379
H  3.083892 0.256038 0.938246
