program: Gaussian 09
title: 000290661
version: EM64L-G09RevD.01
frameworkgroup: C1[X(C14H22O4)]
method: RPBEPBE
basis: SDD
operation: Freq
keyword: #pfreq=noraman
keyword: PBEPBE/SDD
title: #p freq=noraman PBEPBE/SDD
converged: YES YES NO NO
title: Mulliken charges:
elementType: O O O O C C C C C C C C C C C C C C H H H H H H H H H H H H H H H H H H H H H H
charge: -0.416576 -0.414972 -0.218724 -0.225738 -0.059621 -0.140975 -0.073496 0.402111 -0.528464 -0.679104 -0.619093 0.253870 -0.499983 -0.771877 -0.765418 -0.761950 0.124405 0.125529 0.229074 0.249893 0.215887 0.202760 0.230087 0.253543 0.280587 0.226939 0.285096 0.199735 0.197993 0.215041 0.215869 0.224746 0.209763 0.210500 0.220656 0.217386 0.209723 0.210107 0.382829 0.381861
chargesum: 0.00000
title: Mulliken charges with hydrogens summed into heavy atoms:
elementType: O O O O C C C C C C C C C C C C C C
charge: -0.033746 -0.033111 -0.218724 -0.225738 0.169453 0.108918 0.142391 0.402111 -0.095617 -0.144974 -0.107058 0.253870 -0.102254 -0.116221 -0.124500 -0.124735 0.124405 0.125529
polarizability: 1.75990330e+02 -2.59898747e+00 1.49617752e+02 -2.75766200e+00 1.70803885e+00 1.40654524e+02
1716.lowfreq: -19.8952 -12.9278 -0.0006 0.0003 0.0006 5.0767 19.5059 42.8830 60.6035
frequency: 16.9804 42.8525 60.4299 84.5570 112.7161 131.5154 147.3242 151.5597 179.8354 202.4545 226.3801 234.5485 238.7274 257.7920 269.7942 299.4843 307.3393 347.1191 357.5764 401.1452 404.9314 413.8960 427.9959 438.2228 465.9772 497.6878 545.9061 575.4668 589.2092 597.5102 610.4285 638.2055 701.9593 711.2693 751.5846 770.0341 802.3588 818.0468 862.3760 887.0208 899.8465 908.7901 931.1636 937.0293 966.2376 973.3838 981.8990 987.0529 1000.9749 1014.4505 1023.6162 1030.8238 1052.7032 1075.8652 1087.8437 1092.1576 1130.0463 1133.7005 1159.7490 1164.1407 1192.7584 1212.0699 1228.4874 1237.9186 1258.4815 1270.4202 1282.1239 1283.3273 1289.8073 1293.5265 1299.5905 1314.9512 1327.9378 1335.0466 1341.0765 1353.0464 1360.6196 1373.0997 1386.0705 1390.5763 1455.6162 1456.7772 1466.9767 1469.3247 1472.6801 1474.4540 1478.9919 1483.1148 1488.8645 1490.6615 1642.6955 1669.9434 2947.0023 2953.2613 2959.7265 2962.8620 2964.0911 2967.6305 2971.1842 2995.7953 3008.7671 3014.0583 3024.2386 3024.8722 3054.8586 3060.7256 3061.1984 3061.8797 3064.5705 3071.2167 3074.8780 3085.0348 3522.5240 3524.5227
redmass: 4.8998 11.6460 5.4491 8.2109 3.0059 3.7311 2.8423 4.2567 1.1780 2.8799 2.0125 1.7506 1.1805 1.8404 2.0313 2.5032 2.7987 3.1306 2.4450 2.8687 2.0340 4.2820 9.8761 3.1012 2.6259 2.8631 1.9599 1.4476 1.8231 3.3928 1.8115 3.0336 5.0437 4.4168 4.0745 3.9287 2.5725 2.2649 2.2668 1.8468 1.8641 2.1837 1.4986 1.8899 1.9301 3.0137 1.6675 1.5432 2.3741 1.7500 2.0628 1.9590 2.0046 2.8379 2.1497 2.2314 1.3317 1.7343 2.0358 2.3614 2.0078 1.5757 1.4805 1.4831 2.0219 1.5936 1.6576 1.3269 2.3104 1.5547 1.5356 1.6082 1.5733 1.5339 1.5696 1.5109 1.4364 1.2025 1.2149 1.2115 1.0776 1.0732 1.0495 1.0684 1.0821 1.0484 1.0599 1.0583 1.0652 1.0741 9.5659 9.4517 1.0755 1.0650 1.0464 1.0491 1.0777 1.0376 1.0396 1.0847 1.1012 1.0686 1.0712 1.0826 1.0995 1.0995 1.0990 1.0987 1.0991 1.0977 1.1039 1.1032 1.0641 1.0642
irintensity: 0.2505 0.8964 0.0907 1.2396 0.0268 0.1534 0.4123 0.1957 0.0346 0.8559 0.8384 1.2384 0.1597 0.1833 0.7512 0.1576 4.9534 6.8534 3.5428 0.7721 0.2911 2.8601 0.2614 0.4045 3.0736 1.0290 17.6530 71.6667 86.7367 18.9608 93.0137 90.2881 8.3679 5.5006 0.8440 1.3385 0.5784 7.4553 3.2189 3.2034 6.6648 2.5659 1.4643 2.5262 15.0012 52.2277 12.4024 3.9922 79.6377 9.4616 41.8477 30.7895 40.2829 77.2678 55.1153 115.2254 18.9446 49.2075 6.1961 5.9001 10.7253 11.0550 1.0470 6.5910 17.8541 4.2623 4.1038 1.6432 58.7348 18.7009 1.9102 4.3218 2.7233 4.6234 3.6226 0.3842 10.8615 24.3801 11.2678 16.4821 2.1063 3.2411 3.3021 1.4234 8.9772 18.8652 5.9915 12.1187 20.4978 7.5045 421.4081 13.3805 24.1662 27.0102 15.7328 36.0457 47.0371 42.8626 24.1813 15.1100 34.7368 15.1151 42.4725 31.5549 2.5316 29.2233 38.9419 65.7044 78.8257 51.0891 10.5790 12.2082 31.4742 32.5812
temp: 298.150 k
press: 1.00000 atm
elementType: 8 8 8 8 6 6 6 6 6 6 6 6 6 6 6 6 6 6 1 1 1 1 1 1 1 1 1 1 1 1 1 1 1 1 1 1 1 1 1 1
symmnumber: 1
zpe: 888751.4 jmol-1
zpe.correction: 0.338508 hartree
zpe.thermalcorrener: 0.357097 hartree
zpe.thermalcorrenthalpy: 0.358041 hartree
zpe.thermalcorrgfe: 0.292083 hartree
zpe.sumelectzpe: -846.199574 hartree
zpe.sumelectthermal: -846.180985 hartree
zpe.sumelectthermalent: -846.180040 hartree
zpe.sumelectthermalfe: -846.245998 hartree
dipole: 0.0763 0.0106 -0.0493
dipole: 0.0915
quadrupole: -101.1801 -104.1772 -117.6276
quadrupole: 2.9627 6.5495 -4.8587
quadrupole: 6.4816 3.4844 -9.9660 2.9627 6.5495 -4.8587
hfenergy: -846.5380815 hartree
pointgroup: C01 [X(C14H22O4)]
dipole: 0.0303665 0.0038584 -0.0189313 debye
polarizability: 175.8580925|-3.3585322|149.6797175|-2.4240899|2.0554938|140.7247959 unknown
InChI: InChI=1S/C14H22O4/c1-8-4-13(2,3)5-9-6-14(11(15)16,12(17)18)7-10(8)9/h8-10,15,17H,4-7H2,1-3H3
charge 0 multiplicity 1
40 atoms
O  -3.561641 1.134429 -0.757167
O  -3.130465 -1.812143 -0.232305
O  -3.090113 1.378919 1.498342
O  -1.460091 -1.618703 -1.82602
C  0.56311 1.22042 0.372559
C  0.628932 -0.084664 1.221448
C  1.940986 1.68668 -0.172312
C  2.877994 -0.735448 0.07068
C  1.460196 -1.19255 0.524181
C  -0.512276 0.893223 -0.696364
C  -0.863457 -0.481075 1.370808
C  -1.580329 0.0158 0.053464
C  2.722205 0.523977 -0.834575
C  1.809373 2.892775 -1.130494
C  3.781364 -0.432764 1.296963
C  3.535199 -1.871696 -0.75404
C  -2.801299 0.881218 0.391028
C  -2.017593 -1.179857 -0.798675
H  0.163741 2.029264 1.021584
H  1.064521 0.124061 2.217324
H  2.527897 2.026943 0.707091
H  1.551912 -2.060415 1.209243
H  0.911706 -1.555018 -0.369019
H  -0.965568 1.792051 -1.146122
H  -0.097683 0.288984 -1.521936
H  -1.002824 -1.565004 1.528631
H  -1.330588 0.042864 2.223328
H  2.208468 0.222983 -1.771794
H  3.726768 0.887915 -1.133693
H  1.250946 3.723517 -0.658497
H  2.805593 3.275989 -1.420697
H  1.277909 2.611648 -2.059107
H  3.908443 -1.341007 1.916539
H  4.785985 -0.104118 0.968875
H  3.366782 0.357759 1.947257
H  2.9235 -2.127044 -1.640171
H  4.540275 -1.57317 -1.109284
H  3.650292 -2.789314 -0.145566
H  -4.337366 1.711316 -0.521944
H  -3.3866 -2.596244 -0.788861
