program: Gaussian 09
title: 000027843
version: EM64L-G09RevD.01
frameworkgroup: C1[X(C3H4N8)]
method: RPBEPBE
basis: SDD
operation: Freq
keyword: #p
keyword: freq=noraman
keyword: PBEPBE/SDD
title: #p freq=noraman PBEPBE/SDD
converged: YES YES NO NO
title: Mulliken charges:
elementType: N N N N N N N N C C C H H H H
charge: -0.122593 -0.076937 -0.134233 -0.584209 -0.582693 -0.032249 0.050706 -0.032414 0.080310 0.068876 0.007547 0.337561 0.340196 0.343408 0.336722
chargesum: 0.00000
title: Mulliken charges with hydrogens summed into heavy atoms:
elementType: N N N N N N N N C C C
charge: -0.122593 -0.076937 -0.134233 0.093548 0.097438 -0.032249 0.050706 -0.032414 0.080310 0.068876 0.007547
polarizability: 1.51277029e+02 -1.46311813e+01 1.03604097e+02 -2.12933674e-03 5.85358295e-04 3.66708180e+01
1716.lowfreq: -9.9605 0.0007 0.0010 0.0011 5.6406 6.8169 77.8647 111.7168 180.2819
frequency: 77.8598 111.7167 180.2818 188.7866 218.9330 306.4951 322.1872 442.9814 485.2977 497.5132 501.2973 515.4530 548.1652 553.2747 557.4229 602.1428 686.9167 687.0437 711.5832 794.5424 887.0936 912.9992 997.2910 1036.5364 1130.4828 1224.0472 1278.0699 1362.8849 1418.2614 1468.7688 1519.3877 1526.8792 1601.9192 1633.0142 2069.6950 3553.5350 3555.7420 3713.3553 3713.8838
redmass: 9.4560 9.3263 8.2775 6.5966 7.9426 3.3540 4.0977 11.5054 12.7204 3.7089 1.2044 1.2251 1.0565 8.6166 1.0410 7.0034 9.7104 8.7661 11.5149 12.3692 10.0463 3.3436 3.7686 2.8761 2.4450 6.3602 6.4205 10.2146 5.2564 5.8790 1.9255 4.2471 1.4934 2.1567 13.9911 1.0442 1.0447 1.1059 1.1059
irintensity: 1.6374 0.6475 0.9768 7.3274 5.2531 8.8140 1.7938 0.1925 2.9573 1.5138 25.8256 587.2466 6.9816 4.1416 1.3440 10.4947 1.0158 6.5406 0.0047 47.5207 1.2309 16.2950 3.5162 7.1061 0.0422 16.3534 1.8318 571.8631 0.2366 540.7324 49.7432 649.1832 707.5217 215.1943 432.5878 175.6552 63.5767 41.2516 64.2253
temp: 298.150 k
press: 1.00000 atm
elementType: 7 7 7 7 7 7 7 7 6 6 6 1 1 1 1
symmnumber: 1
zpe: 260748.5 jmol-1
zpe.correction: 0.099314 hartree
zpe.thermalcorrener: 0.108721 hartree
zpe.thermalcorrenthalpy: 0.109665 hartree
zpe.thermalcorrgfe: 0.064539 hartree
zpe.sumelectzpe: -553.915050 hartree
zpe.sumelectthermal: -553.905643 hartree
zpe.sumelectthermalent: -553.904698 hartree
zpe.sumelectthermalfe: -553.949824 hartree
dipole: 3.9549 1.7928 0.0028
dipole: 4.3422
quadrupole: -58.7785 -51.4551 -64.0067
quadrupole: -3.2492 0.0089 -0.0008
quadrupole: -0.6984 6.6250 -5.9266 -3.2492 0.0089 -0.0008
hfenergy: -554.0143637 hartree
pointgroup: C01 [X(C3H4N8)]
dipole: -1.6916062 -0.2202075 -0.0922714 debye
dipolederiv: -0.6750185 0.140021 -0.0121515 0.0350919 -1.4844885 -0.0671979 -0.0183856 -0.0618665 -0.2576074 -1.5053484 0.6100869 -0.0279844 0.3463186 -0.8410978 -0.0188313 -0.0428669 -0.0064813 -0.210799 -1.3602582 -0.3570268 -0.0754962 -0.4357761 -0.8999802 -0.0600898 -0.0794432 -0.056169 -0.2096725 -0.4597642 -0.4583244 -0.013485 -0.558683 -1.2786711 -0.0581541 -0.0193514 -0.0539742 -0.7207323 -0.7382821 0.7135129 0.038363 0.6739384 -1.1216479 0.0099775 0.0356219 0.0126222 -0.7103732 -1.5828197 0.5023304 -0.038732 0.8034217 -0.6540276 0.0124229 -0.0222776 -0.0019583 -0.1873102 1.1646042 -0.7693561 0.0077457 -1.3498374 0.881345 -0.0211867 -0.0248865 0.0067095 0.1028211 -0.7479846 0.3824824 -0.0116025 0.6228796 -0.3606186 0.0129257 0.0018243 0.0014369 -0.0585034 1.2325275 0.3605789 0.0680316 0.4773151 1.878787 0.1152162 0.0745532 0.1098593 0.240178 1.5837546 -0.7197887 0.0255795 -0.527143 1.7202534 0.0583568 0.0365751 0.0491369 0.2200562 2.2843205 -0.3793683 0.0774299 -0.0698955 1.1681664 0.0497297 0.0951759 0.0348702 0.2307162 0.2230801 0.0768026 -0.0036861 0.0446451 0.2185657 -0.0076043 -0.005435 -0.0060131 0.3907499 0.1517307 -0.0075109 -0.0118441 0.0376482 0.2805477 -0.0043697 -0.0092871 -0.0064006 0.3895073 0.1744755 -0.0094593 -0.0109939 -0.0626524 0.2997022 -0.008279 -0.0137323 -0.0061906 0.3904331 0.2549827 -0.0849806 -0.0111739 -0.0372711 0.1931644 -0.0129159 -0.0080846 -0.0155813 0.3905363 unknown
polarizability: 138.9485186|-25.5894916|115.5874919|3.4673223|3.1947601|37.0159334 unknown
InChI: InChI=1S/C3H4N8/c4-1-7-2(5)9-3(8-1)10-11-6/h4-5H2
charge 0 multiplicity 1
15 atoms
N  -2.096451 0.023047 -0.157526
N  -0.13011 1.477357 0.018332
N  0.148435 -0.943432 -0.105001
N  -1.757337 -2.293559 -0.271506
N  -2.295306 2.355758 -0.037147
N  2.015117 0.546651 0.068442
N  2.779312 -0.470102 0.048085
N  3.649964 -1.266054 0.045304
C  -1.226712 -1.036717 -0.175182
C  -1.491104 1.250185 -0.060109
C  0.607249 0.339288 -0.011085
H  -2.766626 -2.403942 -0.325695
H  -1.132018 -3.095274 -0.286567
H  -1.864764 3.274324 0.035848
H  -3.304047 2.241068 -0.091193
