program: Gaussian 09
title: 000290638
version: EM64L-G09RevD.01
frameworkgroup: C1[X(C15H13NO2S2)]
method: RPBEPBE
basis: SDD
operation: Freq
keyword: #p
keyword: freq=noraman
keyword: PBEPBE/SDD
title: #p freq=noraman PBEPBE/SDD
converged: NO NO NO NO
title: Mulliken charges:
elementType: S S O O N C C C C C C C C C C C C C C C H H H H H H H H H H H H H
charge: 0.873138 0.297933 -0.517889 -0.517889 -0.271051 0.362274 0.337727 -0.810344 -0.350004 -0.023721 -0.353982 -0.339548 -0.218458 -0.221476 -0.244065 -0.244241 0.450959 -0.364636 -0.364056 -0.800352 0.286850 0.286840 0.242809 0.278834 0.235284 0.237381 0.282872 0.282891 0.242302 0.242292 0.228942 0.243400 0.228982
chargesum: 0.00000
title: Mulliken charges with hydrogens summed into heavy atoms:
elementType: S S O O N C C C C C C C C C C C C C C C
charge: 0.873138 0.297933 -0.517889 -0.517889 -0.271051 0.362274 0.337727 -0.236654 -0.350004 -0.023721 -0.111173 -0.060714 0.016826 0.015905 0.038807 0.038649 0.450959 -0.122334 -0.121763 -0.099028
polarizability: 3.40400380e+02 -1.25444912e+01 2.10191020e+02 -1.02713222e-02 1.46483660e-03 1.45419036e+02
1716.lowfreq: -23.1151 -6.8629 -5.0995 -0.0013 -0.0007 -0.0005 5.2802 23.2579 28.6483
frequency: -22.9964 22.7811 28.6166 34.6587 55.0377 82.9467 92.5475 124.8228 133.2702 144.1427 150.4223 206.5124 224.0532 267.4457 292.7272 324.8131 340.8147 386.1484 387.0676 407.5136 413.0665 426.0618 435.1327 469.3423 494.2089 524.5641 564.4887 575.9888 595.4371 604.1492 622.4668 676.2815 697.2269 710.1926 712.3860 776.9696 777.4719 800.7502 818.8813 829.0130 849.8915 873.2022 893.2735 910.3973 930.1919 962.6507 969.1435 981.3759 990.6934 996.3904 1000.6406 1026.5872 1049.3545 1057.8966 1094.1996 1116.4129 1118.0226 1172.5588 1183.5776 1192.9252 1203.3433 1218.2653 1252.6085 1285.2864 1296.3132 1382.6377 1391.7894 1392.4813 1399.0336 1431.8811 1444.0117 1463.7739 1471.8436 1474.6113 1475.1332 1500.4290 1589.7239 1597.2501 1598.5277 1608.3410 2980.3759 3025.4646 3062.7607 3090.2926 3091.1737 3131.9194 3135.4777 3137.0559 3145.1200 3160.2466 3162.6416 3165.4538 3174.9592
redmass: 8.7098 3.8706 5.3816 1.0163 5.4939 5.6173 6.2391 5.2520 6.1574 5.0960 8.2104 3.8102 8.3126 5.5770 5.7583 4.1934 5.9909 10.3119 4.0539 2.8589 12.5547 3.3061 8.2183 3.9796 4.9670 5.0834 7.0823 6.8111 5.2100 7.8016 6.9607 7.4158 6.0704 3.2823 2.5812 1.4342 5.2268 9.7998 4.5262 1.4402 1.2442 1.3196 7.7135 1.5619 15.0908 1.3080 1.3811 1.3908 1.3990 5.3080 1.3311 2.1397 1.5924 2.5003 2.2243 1.1261 1.2804 1.0784 1.1443 2.3393 1.2986 3.0218 2.8484 1.5185 1.2623 6.5341 2.9368 8.4875 1.2199 1.2688 1.9717 2.7809 1.1004 1.1395 2.0570 7.4598 7.0672 6.0697 7.0200 6.7223 1.0388 1.0569 1.0950 1.1068 1.1000 1.0865 1.0892 1.0894 1.0906 1.0954 1.0953 1.0968 1.0995
irintensity: 1.9787 0.1247 1.6992 0.6717 0.3364 0.5375 1.0612 0.5281 0.5495 1.9147 3.4967 8.5422 18.1256 0.0541 19.0778 2.7774 0.3379 16.6584 0.4918 0.0108 6.3637 2.3019 178.5181 6.4528 13.9963 83.8962 1.3661 4.1736 3.7560 103.7271 0.1412 12.0407 6.0063 0.8049 9.7378 67.5633 9.9826 60.3038 21.4104 27.4675 0.4508 2.4180 82.5595 0.7479 78.2280 0.9482 3.8714 0.1524 1.9918 3.6249 0.0107 8.1318 26.2187 32.5228 15.5492 0.0001 8.1568 4.5171 21.5391 5.9562 7.7756 7.2955 20.5005 3.0476 2.4730 0.3260 9.8105 0.8329 15.0173 5.1291 25.9158 130.4424 16.8479 15.1159 31.2013 423.7271 5.0919 8.5154 0.1073 5.7555 28.7644 10.6426 18.5253 2.5181 15.6751 1.1571 15.4121 9.5834 12.0206 19.4754 0.7455 11.5962 16.3516
temp: 298.150 k
press: 1.00000 atm
elementType: 16 16 8 8 7 6 6 6 6 6 6 6 6 6 6 6 6 6 6 6 1 1 1 1 1 1 1 1 1 1 1 1 1
symmnumber: 1
zpe: 631269.6 jmol-1
zpe.correction: 0.240438 hartree
zpe.thermalcorrener: 0.258682 hartree
zpe.thermalcorrenthalpy: 0.259626 hartree
zpe.thermalcorrgfe: 0.191679 hartree
zpe.sumelectzpe: -1579.136368 hartree
zpe.sumelectthermal: -1579.118124 hartree
zpe.sumelectthermalent: -1579.117180 hartree
zpe.sumelectthermalfe: -1579.185127 hartree
dipole: 1.7503 5.9568 0.0002
dipole: 6.2087
quadrupole: -79.2942 -136.2785 -133.9021
quadrupole: -9.3326 -0.0040 0.0000
quadrupole: 37.1974 -19.7869 -17.4105 -9.3326 -0.0040 0.0000
hfenergy: -1579.3768057 hartree
pointgroup: C01 [X(C15H13N1O2S2)]
dipole: -0.807363 2.3053801 -0.0068897 debye
polarizability: 338.7815602|19.1185255|211.809278|0.1611088|-0.1501623|145.419597 unknown
InChI: InChI=1S/C15H13NO2S2/c1-11-6-8-13(9-7-11)20(17,18)16-15-14-5-3-2-4-12(14)10-19-15/h2-9H,10H2,1H3
charge 0 multiplicity 1
33 atoms
S  1.026538 -1.630017 0.005679
S  -2.249078 -2.386356 0.004327
O  0.986113 -2.442266 -1.410089
O  0.983019 -2.435424 1.425256
N  -0.323484 -0.261998 0.000961
C  -3.983331 -0.249459 -0.003338
C  -2.682906 0.313315 -0.003212
C  -4.041067 -1.7612 0.000609
C  -1.572543 -0.670223 0.000895
C  2.534694 -0.510658 0.004639
C  -5.113044 0.597344 -0.006989
C  -2.493878 1.717369 -0.006792
C  -4.929837 1.998569 -0.010527
C  -3.625245 2.556534 -0.010429
C  3.076553 -0.127975 1.240536
C  3.079902 -0.134744 -1.231878
C  4.822728 1.100195 0.003323
C  4.23098 0.685699 1.226037
C  4.234287 0.678975 -1.218713
C  6.082403 1.946856 0.002645
H  -4.538338 -2.160524 0.900318
H  -4.536302 -2.165346 -0.898068
H  -6.12325 0.173151 -0.007121
H  -1.476538 2.119742 -0.006575
H  -5.803341 2.659689 -0.013379
H  -3.499525 3.644347 -0.013173
H  2.622324 -0.470008 2.175845
H  2.628174 -0.481888 -2.166518
H  4.677246 1.000974 2.176086
H  4.683134 0.989035 -2.169266
H  6.13909 2.592411 0.896205
H  6.985445 1.306161 0.002375
H  6.138379 2.59202 -0.891267
