program: Gaussian 09
title: 000290635
version: EM64L-G09RevD.01
frameworkgroup: C1[X(C19H16N2O2)]
method: RPBEPBE
basis: SDD
operation: Freq
keyword: #p
keyword: freq=noraman
keyword: PBEPBE/SDD
title: #p freq=noraman PBEPBE/SDD
converged: YES YES NO NO
title: Mulliken charges:
elementType: O O N N C C C C C C C C C C C C C C C C C C C H H H H H H H H H H H H H H H H
charge: -0.282494 -0.283025 0.000629 -0.069294 -0.693748 0.389872 0.214047 0.287828 -0.204213 -0.001561 -0.579366 -0.561331 0.206239 0.230826 0.305900 -0.424786 -0.336234 -0.363254 -0.273956 -0.238360 -0.231445 -0.514932 -0.534735 0.254038 0.256156 0.273580 0.290114 0.246821 0.250009 0.293235 0.226167 0.229118 0.230557 0.230472 0.261441 0.213009 0.242695 0.232699 0.227283
chargesum: 0.00000
title: Mulliken charges with hydrogens summed into heavy atoms:
elementType: O O N N C C C C C C C C C C C C C C C C C C C
charge: -0.282494 -0.283025 0.000629 -0.069294 -0.183553 0.389872 0.214047 0.287828 -0.204213 -0.001561 -0.305786 -0.271217 0.206239 0.230826 0.305900 -0.177964 -0.086225 -0.070020 -0.047789 -0.009242 -0.000887 0.189989 0.167942
polarizability: 4.24163899e+02 1.71128036e+00 2.49483851e+02 -6.43727518e-01 2.91778493e+00 9.98632973e+01
1716.lowfreq: -7.8081 -4.6783 -0.0008 -0.0006 0.0008 3.0656 16.2258 37.7413 44.3958
frequency: 16.0150 37.7376 44.3678 70.0823 82.3656 93.2821 121.7793 141.6102 152.7097 179.2541 207.7199 217.3548 242.6479 249.4998 262.9274 286.2534 306.0827 320.2471 342.7685 391.1902 399.9601 408.8886 448.8833 460.8836 479.6067 514.6528 543.1763 579.9734 607.1014 615.3217 621.8420 633.6797 657.0517 692.2037 697.5584 713.4698 741.6651 769.4687 781.8592 811.0896 820.9579 829.3367 852.3047 882.3495 884.9508 921.5713 936.2726 948.1887 961.3255 979.4347 988.3552 989.9156 1013.8884 1015.8422 1028.9988 1063.9613 1087.6708 1105.0507 1111.0066 1113.6168 1127.2488 1145.4365 1151.4180 1159.6142 1172.1969 1173.5104 1187.0315 1194.3406 1235.1144 1245.3292 1258.7720 1275.6499 1301.3121 1323.5824 1345.1685 1382.9494 1385.7265 1401.6192 1416.5337 1430.7693 1434.7035 1437.8088 1454.6149 1461.1794 1466.0570 1473.0224 1477.7316 1482.7737 1483.7638 1521.4626 1537.9575 1585.4231 1586.3690 1611.8753 1628.0098 2966.9768 2977.1443 2982.0644 3025.1142 3058.0441 3093.8674 3126.5480 3127.4190 3133.9583 3138.8896 3150.1029 3155.4715 3157.2997 3170.8292 3173.3391 3200.3232
redmass: 3.9268 4.2557 2.2000 3.0088 4.6785 3.8957 4.4004 2.0852 4.4456 2.7273 3.2286 3.6528 3.2546 2.9974 2.0561 4.6475 3.4794 3.6529 5.2354 4.9515 3.4145 3.8550 3.4957 3.9903 4.8783 3.0200 6.1499 7.1376 6.2004 5.5255 6.0798 5.4094 6.0861 4.1008 1.8234 5.6330 3.3534 6.2095 2.2391 3.7706 7.2901 5.2499 1.2671 1.6745 1.4600 7.3740 1.4299 1.4947 2.1202 5.7361 1.3674 6.0405 5.2388 1.3393 2.3100 3.0173 3.6492 2.2969 1.2371 1.2577 2.2535 1.1298 1.5094 1.3782 1.0624 3.5033 1.5663 1.2915 1.6721 2.7968 3.5261 5.9601 3.9175 1.5325 5.1850 4.8720 4.1866 1.7464 1.8820 1.2386 1.3641 1.9012 1.1198 2.0155 1.0510 1.4282 1.0693 1.8341 2.3970 7.1199 9.1235 9.2813 6.1385 6.0800 7.8376 1.0324 1.0603 1.0348 1.0997 1.1043 1.0967 1.0853 1.1003 1.1053 1.0905 1.0917 1.0923 1.0964 1.0913 1.0959 1.0917
irintensity: 0.0628 1.2975 6.0212 1.0040 1.9908 5.0157 5.8402 1.3563 2.4893 3.2813 0.7984 2.1672 1.1763 0.8151 0.5195 8.3570 1.4194 6.1801 7.2729 0.4919 3.9154 4.0006 7.7019 3.4423 1.0944 0.7605 2.2893 18.0888 9.3383 0.5286 16.9646 2.0796 8.8637 19.0901 46.3434 16.1011 14.1967 27.6892 50.2941 0.0974 14.2946 3.2202 1.3139 9.4677 29.9090 15.1068 5.6300 1.2747 10.5051 70.5075 1.2646 0.0766 33.5604 1.2480 20.3458 13.3157 28.9974 5.1253 14.9162 0.0774 33.4856 0.2463 27.4057 3.6142 5.1012 72.8058 21.3425 30.3306 52.4613 114.7512 69.6402 66.5363 134.1681 1.1281 95.6582 1.7944 240.8683 26.5500 54.2854 16.2985 8.6999 40.7285 14.2490 35.9550 14.5200 81.1695 36.5992 35.7569 67.5833 195.5460 266.6995 55.3553 2.7340 1.4015 52.9106 56.0512 14.0966 108.3885 5.0237 39.5574 42.9234 0.2581 26.2375 14.4919 18.1940 33.3047 4.1817 33.3371 4.7731 21.8575 7.7046
temp: 298.150 k
press: 1.00000 atm
elementType: 8 8 7 7 6 6 6 6 6 6 6 6 6 6 6 6 6 6 6 6 6 6 6 1 1 1 1 1 1 1 1 1 1 1 1 1 1 1 1
symmnumber: 1
zpe: 795951.5 jmol-1
zpe.correction: 0.303162 hartree
zpe.thermalcorrener: 0.322534 hartree
zpe.thermalcorrenthalpy: 0.323479 hartree
zpe.thermalcorrgfe: 0.253975 hartree
zpe.sumelectzpe: -991.949931 hartree
zpe.sumelectthermal: -991.930558 hartree
zpe.sumelectthermalent: -991.929614 hartree
zpe.sumelectthermalfe: -991.999118 hartree
dipole: -2.0400 -1.4254 0.9340
dipole: 2.6582
quadrupole: -107.1491 -125.7481 -138.2544
quadrupole: -14.3704 -6.0371 -2.9010
quadrupole: 16.5681 -2.0309 -14.5372 -14.3704 -6.0371 -2.9010
hfenergy: -992.2530927 hartree
pointgroup: C01 [X(C19H16N2O2)]
dipole: 0.7898245 0.6475176 0.2249506 debye
polarizability: 423.4078607|6.9899786|243.5715178|-11.3675184|-30.3902776|106.5316687 unknown
InChI: InChI=1S/C19H16N2O2/c1-22-16-9-13-8-15-18(12-6-4-3-5-7-12)20-11-21-19(15)14(13)10-17(16)23-2/h3-7,9-11H,8H2,1-2H3
charge 0 multiplicity 1
39 atoms
O  4.468107 2.395509 -0.858127
O  5.145077 -0.315279 -0.277059
N  0.013893 -2.393515 0.549364
N  -2.398799 -2.021114 0.562791
C  -0.393927 1.213076 -0.295605
C  1.114247 0.988431 -0.308952
C  -0.947838 -0.163608 0.058672
C  1.411669 -0.364188 0.002115
C  0.150828 -1.074216 0.228498
C  -2.257633 -0.674778 0.236676
C  2.159564 1.888805 -0.56348
C  2.738262 -0.840525 0.043544
C  3.501957 1.440117 -0.518477
C  3.790934 0.058792 -0.231902
C  -3.535793 0.08597 0.109496
C  -1.290672 -2.786229 0.698312
C  -3.596117 1.471571 -0.211705
C  -4.762149 -0.607394 0.320445
C  -4.836553 2.135978 -0.317358
C  -5.999349 0.056591 0.214672
C  -6.044794 1.434474 -0.105215
C  5.707354 2.494687 -0.057101
C  5.457709 -1.731496 -0.058755
H  -0.685644 1.979532 0.449147
H  -0.759603 1.564421 -1.280553
H  1.98903 2.943745 -0.799286
H  2.920077 -1.894421 0.269276
H  -1.453551 -3.837992 0.955826
H  -2.686177 2.047881 -0.382749
H  -4.706652 -1.671115 0.567012
H  -4.858676 3.202946 -0.566117
H  -6.929341 -0.498279 0.381328
H  -7.006592 1.952894 -0.188069
H  6.221511 3.382602 -0.455244
H  6.328151 1.59355 -0.173526
H  5.462823 2.648698 1.011317
H  6.549674 -1.803815 -0.168323
H  4.961345 -2.368905 -0.814956
H  5.160051 -2.057301 0.956374
