program: Gaussian 09
title: 000290631
version: EM64L-G09RevD.01
frameworkgroup: C1[X(C9H12O3)]
method: RPBEPBE
basis: SDD
operation: Freq
keyword: #pfreq=noraman
keyword: PBEPBE/SDD
title: #p freq=noraman PBEPBE/SDD
converged: YES YES NO NO
title: Mulliken charges:
elementType: O O O C C C C C C C C C H H H H H H H H H H H H
charge: -0.290810 -0.269116 -0.227582 0.338713 0.082281 -0.743650 -0.727318 0.295524 -0.376471 -0.536429 -0.264772 -0.175569 0.223163 0.267667 0.213821 0.265146 0.221521 0.211350 0.276248 0.246516 0.226156 0.229029 0.254145 0.260435
chargesum: 0.00000
title: Mulliken charges with hydrogens summed into heavy atoms:
elementType: O O O C C C C C C C C C
charge: -0.290810 -0.269116 -0.227582 0.338713 0.082281 -0.038999 -0.029301 0.295524 -0.100223 0.165273 -0.010626 0.084866
polarizability: 1.31010634e+02 -2.21905931e+00 1.01793329e+02 1.40411813e+00 -7.56650541e+00 7.89688638e+01
1716.lowfreq: -12.4061 -2.0873 -0.0007 0.0005 0.0005 10.5980 45.5662 93.9223 115.3249
frequency: 45.4488 93.9158 115.3231 120.9681 127.5454 151.9600 168.7756 185.2676 249.8036 285.9450 308.2114 352.6321 366.3791 442.6456 450.0867 532.5714 560.7746 592.5010 632.1016 670.8695 729.8192 819.3367 844.0391 852.9087 871.4924 887.1484 890.1632 916.6762 944.6859 986.2644 997.5766 1023.8513 1050.0443 1085.2662 1114.2605 1120.6100 1136.0405 1156.9960 1204.4216 1241.5952 1262.9349 1354.7018 1367.9523 1384.3754 1398.3089 1427.2554 1451.2923 1458.3705 1460.5415 1477.1937 1479.4806 1483.7885 1486.5698 1571.7449 2975.0283 2986.5228 2990.8905 3070.7160 3071.4391 3076.6759 3118.6483 3125.6037 3126.2840 3220.1846 3238.6040 3266.8763
redmass: 4.2486 3.1495 2.5188 2.4972 1.2470 1.1277 1.8179 1.4646 3.8606 3.9466 3.5532 5.2167 2.5095 6.9901 4.3698 3.2629 7.0270 3.1339 5.6351 5.4633 1.2704 1.5142 4.9275 3.5204 5.8011 1.5178 3.6036 3.9580 1.3963 1.4225 2.0230 2.4450 2.4204 2.4197 1.3908 1.7172 1.6224 1.4333 1.5954 5.0033 4.3350 2.5344 3.6227 1.2855 1.2241 1.1602 1.0503 1.0523 1.0656 1.2468 1.1749 1.1690 2.1557 6.9530 1.0313 1.0379 1.0377 1.0986 1.1030 1.0979 1.0982 1.1023 1.0981 1.0914 1.0995 1.1083
irintensity: 0.9918 1.3125 5.1942 2.1234 0.4046 1.1139 2.9400 2.1873 2.2207 5.5922 1.4436 10.6531 4.8470 1.0534 7.9118 5.2045 12.4811 6.2254 11.3470 10.3015 79.5359 43.8723 42.9490 7.9682 0.2538 2.2672 3.3300 22.9437 2.7030 11.0065 42.9488 24.7769 21.5658 124.2122 6.9203 34.0609 28.9088 3.7265 4.7373 47.5028 5.9110 1.7406 14.0403 27.5606 20.4663 5.7334 6.2551 6.3830 0.9931 18.1911 4.3277 22.2614 2.4658 0.9576 53.0125 7.4094 45.4429 0.5430 33.1425 42.5939 7.5552 23.1659 6.8042 4.0977 0.0547 0.2902
temp: 298.150 k
press: 1.00000 atm
elementType: 8 8 8 6 6 6 6 6 6 6 6 6 1 1 1 1 1 1 1 1 1 1 1 1
symmnumber: 1
zpe: 500391.4 jmol-1
zpe.correction: 0.190589 hartree
zpe.thermalcorrener: 0.203273 hartree
zpe.thermalcorrenthalpy: 0.204217 hartree
zpe.thermalcorrgfe: 0.151820 hartree
zpe.sumelectzpe: -574.832286 hartree
zpe.sumelectthermal: -574.819602 hartree
zpe.sumelectthermalent: -574.818658 hartree
zpe.sumelectthermalfe: -574.871056 hartree
dipole: -1.2226 0.3493 -1.4346
dipole: 1.9170
quadrupole: -62.2115 -64.0422 -74.9902
quadrupole: -0.9414 -1.0734 1.7006
quadrupole: 4.8698 3.0391 -7.9089 -0.9414 -1.0734 1.7006
hfenergy: -575.0228753 hartree
pointgroup: C01 [X(C9H12O3)]
dipole: -0.4744853 -0.055817 0.5835823 debye
dipolederiv: -0.571424 -0.1132142 0.0327067 -0.0211212 -0.589534 -0.0870286 0.1419542 0.0337872 -0.673157 -0.5479147 0.0567911 0.0155316 0.046864 -1.1466929 0.008527 0.0519793 0.0682854 -0.3868656 -0.3899153 -0.0197874 0.1325106 -0.0846789 -0.2741331 0.1936004 0.0904021 0.2052122 -0.3932831 0.4320901 0.0173516 0.0948948 0.2000754 0.4876133 0.050452 0.0446166 0.1814085 0.3143762 0.7158095 -0.1289313 -0.0554941 -0.2338882 0.9041126 -0.0574812 -0.1973239 -0.464745 0.4091774 -0.0968604 0.0480944 -0.0508875 0.0775291 -0.168525 -0.0119611 -0.0472318 0.0180348 0.0378753 -0.1781076 0.0689452 -0.0960779 -0.0323415 -0.0776878 0.0132938 0.0177375 0.013833 0.0367758 0.0886333 0.0633476 -0.0595288 0.0044503 0.0095215 -0.1694061 0.0196505 -0.1473406 0.141367 -0.083601 -0.0809263 0.0665731 -0.0592456 -0.1266835 -0.0626007 0.0626305 -0.0623527 -0.1013071 0.2708915 0.093666 -0.0035053 -0.0046576 0.5953337 0.1013364 -0.0463155 0.2313328 0.2592445 0.0082506 -0.0278957 -0.0417683 -0.0208845 -0.1665305 -0.0463578 -0.0295906 -0.0523983 -0.1340325 0.0875315 0.037574 -0.1196828 0.085858 -0.0411335 -0.1682717 -0.1648531 -0.1457294 0.121823 -0.0308333 -0.1068764 0.1004298 -0.0913196 -0.0130907 0.0349594 0.0915731 0.0788778 0.0479405 -0.0188992 0.0718596 -0.0663608 0.0640523 0.1056676 -0.0149088 -0.0683579 0.0157017 0.0790223 0.111241 0.0096334 -0.0011012 -0.0094011 0.0226897 -0.0491872 -0.0118047 -0.1017086 -0.1044492 0.1209755 0.0499216 -0.0033936 0.0903812 -0.0621265 0.0167374 -0.0084354 -0.000324 0.0992913 -0.0822374 -0.0774 0.0501767 -0.0814795 0.0522337 0.0693551 0.096964 0.0720658 0.0082796 0.0558448 -0.0097744 -0.0040208 -0.0189089 0.0585023 -0.0991353 -0.0668021 -0.1018005 -0.0941486 0.1236762 0.0367815 -0.0362725 0.0333585 0.110988 0.0888397 -0.0372016 0.0888329 0.0830484 0.0391011 0.0055738 0.083898 -0.0199111 0.0522359 0.0214359 0.0904896 -0.1018491 -0.0797675 -0.1570838 -0.096695 -0.0456339 -0.0231799 0.0419101 -0.0201135 -0.0226244 -0.0566307 0.0573045 0.0730483 0.067461 -0.0455918 0.0539755 -0.0914075 0.0624909 -0.0563065 0.0981901 0.0374461 -0.0301846 -0.0048326 0.0640386 -0.0094657 0.1694303 0.0404617 0.0716674 0.0386283 0.1298063 0.0599677 0.0393325 -0.0114405 0.0539391 0.1473064 0.0849621 -0.0228172 0.0906883 0.1042325 unknown
polarizability: 130.9440962|2.071136|99.1213082|-2.1770005|-10.594674|81.7074227 unknown
InChI: InChI=1S/C9H12O3/c1-8(2)9(10-3,12-8)7-5-4-6-11-7/h4-6H,1-3H3
charge 0 multiplicity 1
24 atoms
O  1.271283 0.051188 -1.24888
O  1.021171 -1.460566 0.708393
O  -1.493754 0.793329 -0.792159
C  1.657557 0.849682 0.014938
C  0.616445 -0.249212 0.068684
C  1.23738 2.308358 -0.020549
C  3.057752 0.565349 0.528844
C  -0.854392 -0.036166 0.154983
C  -1.795794 -0.519897 1.053662
C  0.708185 -2.669793 -0.084652
C  -3.080116 0.02063 0.66229
C  -2.859489 0.808192 -0.454598
H  1.975341 2.897441 -0.594737
H  0.250398 2.432963 -0.491538
H  1.19788 2.719441 1.005594
H  3.245312 -0.516894 0.583938
H  3.80344 1.031197 -0.141172
H  3.186588 0.996847 1.539043
H  -1.583011 -1.175473 1.895149
H  1.224924 -2.622755 -1.059949
H  -0.382382 -2.771943 -0.242192
H  1.084214 -3.515079 0.510756
H  -4.038265 -0.154358 1.147856
H  -3.494364 1.406717 -1.101908
