program: Gaussian 09
title: 000290624
version: EM64L-G09RevD.01
frameworkgroup: C1[X(C24H16O2)]
method: RPBEPBE
basis: SDD
operation: Freq
keyword: #pfreq=noraman
keyword: PBEPBE/SDD
title: #p freq=noraman PBEPBE/SDD
converged: YES YES NO NO
title: Mulliken charges:
elementType: O O C C C C C C C C C C C C C C C C C C C C C C C C H H H H H H H H H H H H H H H H
charge: -0.270324 -0.220439 -0.053453 0.330709 0.074056 0.338699 0.386223 0.070851 0.422821 -0.403555 0.088982 -0.467115 -0.252470 -0.373161 -0.333448 -0.406041 -0.380560 -0.358283 -0.437800 -0.236657 -0.242908 -0.241639 -0.244900 -0.234106 -0.238026 -0.240158 0.269227 0.244473 0.232982 0.274453 0.259929 0.254307 0.258679 0.275618 0.244881 0.236860 0.230209 0.227658 0.226752 0.227670 0.229705 0.229300
chargesum: 0.00000
title: Mulliken charges with hydrogens summed into heavy atoms:
elementType: O O C C C C C C C C C C C C C C C C C C C C C C C C
charge: -0.270324 -0.220439 -0.053453 0.330709 0.074056 0.338699 0.386223 0.070851 0.422821 -0.134328 0.088982 -0.222642 -0.019488 -0.097543 -0.058995 -0.146112 -0.126253 -0.099604 -0.192920 0.000203 -0.012699 -0.013982 -0.018148 -0.006435 -0.008321 -0.010857
polarizability: 3.02319573e+02 7.85057086e+00 2.34268722e+02 6.44152185e+00 1.83551264e+01 2.36986539e+02
1716.lowfreq: -6.6485 -1.4349 -0.0007 -0.0005 -0.0004 7.6454 27.4128 32.6508 43.5286
frequency: 27.3261 32.6302 43.4888 54.7053 63.6638 75.3004 100.2100 168.9026 193.6363 212.5074 232.3920 236.3162 264.7743 290.0310 295.9919 306.3591 349.9424 395.5046 401.1072 403.6707 438.6321 449.9651 469.3227 471.4007 491.3117 516.8238 536.0862 558.3226 599.6218 613.9486 615.9036 621.9828 647.9738 656.2743 668.3916 703.4118 706.3145 713.7894 751.0178 765.4167 775.5434 783.8471 789.0880 796.3598 851.0964 855.3689 858.4624 861.6578 897.1828 906.0516 933.3282 937.2969 943.3722 954.8983 961.0655 981.0992 986.7278 990.3182 990.7414 991.3738 997.7077 1000.8671 1001.3758 1024.3671 1030.1161 1035.1224 1057.7399 1079.0976 1086.4202 1094.2582 1121.6047 1167.7500 1173.1493 1173.8758 1184.6525 1189.7498 1191.0587 1195.4781 1218.7944 1227.1088 1251.2868 1267.7185 1317.6498 1320.5877 1376.5761 1378.8390 1381.0782 1399.7541 1419.1695 1434.2833 1435.0860 1436.3618 1459.3436 1479.0645 1480.8250 1514.6876 1589.3832 1589.9871 1591.3199 1592.3959 1608.3441 1611.7633 1625.9994 1638.3466 3125.4734 3125.7620 3128.2232 3129.7985 3135.2658 3136.1475 3144.4262 3147.5916 3148.6762 3151.0316 3158.1677 3158.7309 3163.0980 3168.8205 3168.9732 3169.8676
redmass: 3.8152 5.3144 3.9472 6.0590 5.2469 6.0449 6.0602 4.1269 5.6552 5.1169 4.4434 5.3230 4.9653 4.9340 5.0980 6.7723 7.7533 6.0459 2.8302 2.9462 6.7137 4.8230 6.2571 3.4656 3.8843 4.0399 6.1840 5.4075 5.8980 6.0085 6.3505 5.1176 6.0708 5.3588 5.3471 1.7924 1.9421 3.4290 2.6222 2.0599 2.0277 2.5340 2.0727 3.2476 2.2709 1.3026 3.6150 1.2824 4.9029 2.8300 1.5454 1.6033 1.8088 1.5472 5.3508 1.3866 1.3830 5.6085 2.6829 1.9321 1.3338 1.3862 1.3272 2.8428 2.1729 2.9658 3.0553 1.9044 1.6009 1.7645 2.3610 1.7720 1.0508 1.0517 1.3150 1.4113 1.1880 1.2264 3.6171 1.8162 2.4504 2.3436 1.3291 1.3370 3.1419 6.7620 9.0941 6.1898 2.1915 2.2243 2.2218 5.3928 2.6340 2.1694 2.2427 4.7328 7.2727 6.1616 5.7123 6.2825 5.9848 6.0863 8.0429 10.8552 1.0847 1.0848 1.0879 1.0871 1.0883 1.0883 1.0916 1.0930 1.0926 1.0917 1.0959 1.0963 1.0986 1.1001 1.0984 1.0996
irintensity: 0.0684 0.5434 0.0799 1.3647 0.3052 1.7213 0.4551 2.7332 0.5804 0.2232 0.4485 0.0534 0.7397 1.1601 2.1799 4.9865 4.2182 3.2968 0.0717 0.3829 3.4183 1.8529 0.6575 0.7731 5.3551 3.9145 1.9903 14.7176 0.5194 0.2961 0.1891 3.9538 7.3334 17.0003 3.8492 35.0989 42.3373 24.0750 32.7287 55.9935 15.7786 30.6993 36.1847 2.3563 69.7949 0.1630 1.5771 0.6935 49.6137 4.4482 1.8788 6.6349 10.9741 2.1919 78.2168 0.0622 0.6640 1.8613 1.0222 0.4027 0.8265 2.2848 0.5016 17.2691 9.4672 38.3153 105.6202 2.9556 1.7969 15.6243 56.0406 8.1969 0.0464 0.0556 17.4024 19.4908 9.3048 0.0445 42.6904 4.2683 19.4942 81.7863 1.3960 2.5002 7.3044 1.0823 0.5138 9.5345 3.4642 17.6711 10.3855 6.2957 5.9352 14.8816 18.5755 13.3803 11.1297 0.9459 8.2936 0.3815 3.7414 3.8712 71.0950 217.3035 0.3175 0.1055 1.1452 3.6574 5.4949 6.7349 15.6787 25.6455 13.7137 12.9000 17.5335 28.3086 23.1314 22.8785 15.9024 12.0444
temp: 298.150 k
press: 1.00000 atm
elementType: 8 8 6 6 6 6 6 6 6 6 6 6 6 6 6 6 6 6 6 6 6 6 6 6 6 6 1 1 1 1 1 1 1 1 1 1 1 1 1 1 1 1
symmnumber: 1
zpe: 849345.3 jmol-1
zpe.correction: 0.323499 hartree
zpe.thermalcorrener: 0.342984 hartree
zpe.thermalcorrenthalpy: 0.343928 hartree
zpe.thermalcorrgfe: 0.274592 hartree
zpe.sumelectzpe: -1072.881967 hartree
zpe.sumelectthermal: -1072.862482 hartree
zpe.sumelectthermalent: -1072.861538 hartree
zpe.sumelectthermalfe: -1072.930873 hartree
dipole: 0.7644 -1.4767 -4.9884
dipole: 5.2582
quadrupole: -127.5409 -139.6512 -153.8790
quadrupole: -2.2352 -3.4906 -2.9455
quadrupole: 12.8161 0.7059 -13.5220 -2.2352 -3.4906 -2.9455
hfenergy: -1073.205466 hartree
pointgroup: C01 [X(C24H16O2)]
dipole: 0.3698742 0.3590146 2.0034913 debye
polarizability: 299.3551466|-15.522893|233.7969408|-5.5431741|18.7171618|240.4227467 unknown
InChI: InChI=1S/C24H16O2/c25-23-20-15-7-9-17-10-8-16-21(22(17)20)24(26-23,18-11-3-1-4-12-18)19-13-5-2-6-14-19/h1-16H
charge 0 multiplicity 1
42 atoms
O  -0.249559 0.058011 -1.748401
O  1.163602 -0.833162 -3.305717
C  -0.624473 0.134174 -0.276827
C  0.546606 0.707156 0.530243
C  1.879144 0.375341 0.115576
C  -0.967719 -1.310984 0.156819
C  -1.851596 1.060777 -0.254354
C  2.121515 -0.274011 -1.14346
C  3.002114 0.710872 0.961383
C  0.354453 1.42889 1.712505
C  1.018794 -0.420461 -2.134182
C  2.763977 1.430298 2.17817
C  1.46562 1.800808 2.53238
C  3.421319 -0.651807 -1.509486
C  -1.694039 -2.131965 -0.745354
C  -2.93899 0.818353 0.618538
C  -0.620764 -1.826166 1.428218
C  -1.870738 2.214379 -1.078245
C  4.317237 0.310569 0.555649
C  4.520738 -0.376442 -0.646026
C  -2.058053 -3.444979 -0.382451
C  -4.029472 1.717042 0.670653
C  -0.988822 -3.142601 1.79244
C  -2.962415 3.106709 -1.031511
C  -1.70833 -3.956281 0.890129
C  -4.045283 2.864032 -0.153463
H  -0.658938 1.704104 2.021565
H  3.614059 1.689247 2.819975
H  1.285353 2.366853 3.45232
H  -1.951625 -1.737913 -1.733589
H  -2.942772 -0.076576 1.249828
H  -0.058744 -1.209457 2.137023
H  -1.040512 2.393365 -1.768136
H  3.572616 -1.130271 -2.482457
H  5.167329 0.555074 1.203589
H  5.529798 -0.681499 -0.941584
H  -2.611798 -4.069707 -1.091947
H  -4.866127 1.515855 1.34899
H  -0.709048 -3.529875 2.778616
H  -2.970752 3.989219 -1.680934
H  -1.989939 -4.97725 1.171233
H  -4.892867 3.557676 -0.118015
