program: Gaussian 09
title: 000290618
version: EM64L-G09RevD.01
frameworkgroup: C1[X(C26H23NO3S)]
method: RPBEPBE
basis: SDD
operation: Freq
keyword: #p
keyword: freq=noraman
keyword: PBEPBE/SDD
title: #p freq=noraman PBEPBE/SDD
converged: YES YES NO NO
title: Mulliken charges:
elementType: S O O O N C C C C C C C C C C C C C C C C C C C C C C C C C C H H H H H H H H H H H H H H H H H H H H H H H
charge: 0.896222 -0.526052 -0.521199 -0.532615 -0.526962 -0.086637 0.510602 -0.368931 0.305448 0.386764 -0.501332 0.451070 -0.219188 -0.423390 -0.342429 -0.403006 -0.354551 -0.360905 -0.812788 -0.240647 -0.249522 -0.245697 -0.230417 -0.236594 -0.244282 0.348405 -0.353052 -0.306922 -0.204836 -0.211324 -0.238344 0.274321 0.306976 0.248097 0.390535 0.269881 0.272006 0.243378 0.239288 0.322547 0.236455 0.241799 0.229234 0.229882 0.229305 0.227464 0.227042 0.230464 0.230500 0.224319 0.276097 0.229030 0.232859 0.231633
chargesum: 0.00000
title: Mulliken charges with hydrogens summed into heavy atoms:
elementType: S O O O N C C C C C C C C C C C C C C C C C C C C C C C C C C
charge: 0.896222 -0.135517 -0.521199 -0.532615 -0.204415 -0.086637 0.510602 -0.368931 0.305448 0.386764 -0.227012 0.451070 0.087788 -0.175293 -0.072549 -0.131000 -0.111173 -0.121617 -0.105301 -0.010766 -0.020217 -0.018234 -0.003374 -0.006130 -0.013782 0.348405 -0.128733 -0.030825 0.024195 0.021536 -0.006711
polarizability: 4.05490720e+02 -2.35871459e+01 3.22045266e+02 -2.17165678e+00 -4.64716707e+00 2.67093180e+02
1716.lowfreq: -31.5400 0.0006 0.0007 0.0010 2.6039 5.5614 8.5964 17.8303 18.2481
frequency: -31.5274 17.4231 18.1621 33.3495 39.5849 46.6394 55.1241 58.5436 70.9230 77.1928 82.7037 108.4867 130.7228 156.0454 181.1398 184.1281 200.1523 211.5531 217.9999 234.1488 241.6990 260.7779 286.5047 295.4279 299.1634 318.0391 340.8038 354.9749 397.3150 400.4422 404.6075 405.8865 412.9845 428.0843 438.8642 459.9262 479.0984 508.8028 525.0387 547.4205 564.3037 568.2998 589.8973 611.8575 616.2549 616.8036 638.8287 642.6451 683.3939 688.8031 703.4976 706.1166 730.5196 751.4466 763.2586 769.9419 770.3489 804.8776 815.8664 817.8037 834.3341 841.1799 854.6508 857.8966 883.2771 913.4213 913.5076 923.4605 930.5615 936.0011 948.4411 962.3554 971.9716 978.3298 980.5794 981.6703 984.1322 984.8739 985.5742 991.1164 991.5628 992.5572 997.3267 999.2998 1014.9763 1021.5593 1028.5880 1030.7723 1051.6866 1080.8915 1085.8647 1090.2555 1128.4476 1163.2163 1171.7858 1172.1079 1174.6665 1177.5498 1181.1468 1190.0813 1192.6965 1195.5319 1231.7662 1237.5623 1260.9646 1274.8185 1312.7869 1323.3829 1335.9983 1358.5452 1373.5642 1378.2281 1382.9324 1386.5998 1394.5724 1399.4847 1433.4934 1437.1642 1446.8568 1452.2673 1470.3673 1472.9297 1473.9145 1480.0787 1481.4630 1575.5706 1579.8537 1589.7124 1593.2722 1596.3815 1598.7153 1609.4525 1612.2308 2981.0462 3063.3866 3093.4809 3121.5151 3123.5965 3126.8227 3131.3363 3134.1323 3135.7768 3136.3100 3143.4502 3144.1079 3146.9577 3148.1324 3154.5127 3157.0695 3158.1448 3158.9520 3163.8708 3168.4466 3171.2404 3183.8329 3273.2621
redmass: 1.0144 5.6806 5.6207 3.9173 4.4666 4.2445 4.5668 5.2413 4.4262 4.6781 4.8380 5.5853 5.3874 7.7653 8.6281 5.0288 6.7246 4.9123 7.3883 7.0449 5.5460 4.7598 5.5869 5.3507 4.8301 6.6086 5.1999 5.4651 6.0244 2.8893 3.1953 2.9350 4.4272 6.1073 3.7815 4.0313 4.5573 3.8816 3.7861 4.7049 5.1607 4.9276 4.7327 6.3470 6.3579 6.3850 5.1557 6.4965 6.3492 1.7779 1.6881 1.7260 3.8282 1.9433 2.0575 1.8340 2.0039 3.0151 4.4124 4.5164 1.2886 1.3101 1.2590 1.2569 2.3911 1.8756 1.5163 1.5315 1.7780 1.8174 2.7543 1.9837 1.4961 2.3186 1.5520 1.5186 4.2414 1.6304 4.3580 4.8401 4.4105 1.3548 1.3810 1.3461 1.8907 2.1239 2.2540 2.1681 1.5999 1.5484 1.5966 1.6346 2.2709 1.5087 1.0857 1.0950 1.0553 1.8291 1.1728 1.6563 1.7917 1.1478 3.5358 2.7474 1.3008 1.5324 1.3487 1.3235 1.2802 3.9491 2.1930 5.9346 5.9366 2.9228 3.0830 1.2421 2.1921 2.2260 2.1738 2.5084 1.1179 2.1846 1.0588 2.2306 2.1947 6.1298 5.7834 6.0981 6.2507 6.0518 5.8698 6.0458 6.0772 1.0389 1.0948 1.1000 1.0868 1.0848 1.0847 1.0882 1.0878 1.0880 1.0880 1.0905 1.0931 1.0935 1.0926 1.0953 1.0914 1.0878 1.0837 1.0984 1.1008 1.0976 1.0970 1.0762
irintensity: 0.4532 0.5102 0.4183 0.0670 0.1392 0.1446 0.7538 0.3338 0.2132 0.2107 0.2907 3.2306 5.6358 14.5828 5.5839 2.8425 1.7543 1.4481 9.5315 5.6560 5.4599 1.9272 4.2399 1.1558 1.8029 18.1102 5.1246 18.3095 19.3270 0.6868 1.7695 3.5044 9.0534 33.4798 17.1614 18.4013 55.5713 19.2953 4.5020 5.4528 3.5504 15.7897 13.0865 1.0870 0.4225 0.4613 9.4263 13.4951 4.6570 37.1811 68.5866 41.1622 0.4369 262.6924 212.9936 63.0288 67.6862 157.6414 8.8453 26.5718 1.3155 15.8761 4.8570 2.6104 9.9175 15.2600 10.6709 0.7800 36.8944 10.2282 11.2247 29.1150 9.6459 11.7119 1.0490 1.7460 8.3287 4.6458 0.8706 2.9106 0.8400 0.1729 0.5090 0.2694 15.1400 3.6133 4.9429 10.7613 17.1763 12.8087 0.4486 6.0549 8.9528 17.6984 1.9388 2.8936 0.0658 27.7442 1.7626 12.3409 8.1714 2.3242 0.0681 18.4421 27.4688 1.6281 0.3263 1.1260 21.7472 21.0187 27.0615 5.2367 2.2526 13.3923 9.3107 17.2597 21.9285 12.2050 16.5475 18.2250 21.5345 15.2878 10.6753 11.6605 18.0220 6.0121 0.6169 0.8560 0.6789 13.9417 0.4375 2.9192 1.9433 23.2873 14.1290 14.5832 5.8492 1.4001 0.5953 2.4681 1.0134 4.4906 8.2365 1.8647 22.5225 22.6587 23.4354 13.2607 53.6216 232.4159 72.5445 27.4536 19.6090 10.9827 5.0609 79.0746
temp: 298.150 k
press: 1.00000 atm
elementType: 16 8 8 8 7 6 6 6 6 6 6 6 6 6 6 6 6 6 6 6 6 6 6 6 6 6 6 6 6 6 6 1 1 1 1 1 1 1 1 1 1 1 1 1 1 1 1 1 1 1 1 1 1 1
symmnumber: 1
zpe: 1096669.8 jmol-1
zpe.correction: 0.417699 hartree
zpe.thermalcorrener: 0.444986 hartree
zpe.thermalcorrenthalpy: 0.445930 hartree
zpe.thermalcorrgfe: 0.358169 hartree
zpe.sumelectzpe: -1680.704447 hartree
zpe.sumelectthermal: -1680.677161 hartree
zpe.sumelectthermalent: -1680.676217 hartree
zpe.sumelectthermalfe: -1680.763978 hartree
dipole: 1.9550 5.6555 4.3547
dipole: 7.4007
quadrupole: -167.2414 -191.2625 -179.8532
quadrupole: -10.8804 -2.9893 -4.2443
quadrupole: 12.2109 -11.8101 -0.4008 -10.8804 -2.9893 -4.2443
hfenergy: -1681.1221468 hartree
pointgroup: C01 [X(C26H23N1O3S1)]
dipole: -0.6975585 2.2358599 -1.7297405 debye
polarizability: 407.112352|20.3788066|320.4689268|-3.2475113|4.0569143|267.0478866 unknown
InChI: InChI=1S/C26H23NO3S/c1-20-17-18-25(31(29,30)27-23-15-9-4-10-16-23)24(19-20)26(28,21-11-5-2-6-12-21)22-13-7-3-8-14-22/h2-19,27-28H,1H3
charge 0 multiplicity 1
54 atoms
S  1.439307 -2.09151 0.440342
O  -0.482724 -0.321571 1.689632
O  2.579161 -2.997427 -0.272917
O  0.268439 -2.853234 1.30409
N  2.364205 -0.910617 1.714799
C  -1.289925 0.030401 0.496633
C  -0.428261 -0.121093 -0.793664
C  0.683247 -0.986929 -0.953071
C  -2.525366 -0.89943 0.465774
C  -1.681498 1.513612 0.697034
C  -0.790247 0.619158 -1.949936
C  -0.103794 0.524014 -3.185369
C  1.401518 -1.109868 -2.156906
C  1.004737 -0.35232 -3.27559
C  -3.36436 -0.914855 1.612771
C  -2.913485 2.026627 0.222636
C  -2.828869 -1.758553 -0.615746
C  -0.774546 2.395789 1.334358
C  -0.562758 1.33302 -4.384003
C  -4.484096 -1.768166 1.671359
C  -3.231851 3.395208 0.378507
C  -3.954209 -2.613324 -0.558183
C  -1.091777 3.761725 1.494323
C  -4.785432 -2.621328 0.582488
C  -2.320885 4.269537 1.012388
C  3.504173 -0.25553 1.176438
C  3.507966 1.147601 0.921051
C  4.683876 -1.017958 0.940588
C  4.688095 1.782272 0.483442
C  5.846585 -0.378137 0.467977
C  5.858235 1.021313 0.246548
H  -1.639152 1.3061 -1.873643
H  2.253353 -1.796923 -2.202563
H  1.562225 -0.442443 -4.214415
H  -0.522259 -1.325678 1.816102
H  -3.126313 -0.258383 2.456678
H  -3.636726 1.352552 -0.249936
H  -2.188716 -1.774981 -1.50332
H  0.162245 1.999467 1.736425
H  1.575652 -0.274822 1.968021
H  -0.935344 2.327536 -4.082664
H  -1.389497 0.819935 -4.912416
H  0.253745 1.477293 -5.111886
H  -5.119139 -1.771868 2.564176
H  -4.192689 3.773581 0.011874
H  -4.17245 -3.278468 -1.400985
H  -0.384367 4.428619 2.000148
H  -5.65383 -3.287934 0.627963
H  -2.568365 5.329495 1.13825
H  2.592723 1.73166 1.080877
H  4.667587 -2.092491 1.141643
H  4.692692 2.864473 0.312879
H  6.75158 -0.96801 0.28656
H  6.771189 1.514363 -0.104859
