program: Gaussian 09
title: 000290606
version: EM64L-G09RevD.01
frameworkgroup: C1[X(C27H22ClNO2)]
method: RPBEPBE
basis: SDD
operation: Freq
keyword: #p
keyword: freq=noraman
keyword: PBEPBE/SDD
title: #p freq=noraman PBEPBE/SDD
converged: YES YES NO NO
title: Mulliken charges:
elementType: Cl O O N C C C C C C C C C C C C C C C C C C C C C C C C C C C H H H H H H H H H H H H H H H H H H H H H H
charge: -0.053056 -0.494609 -0.325951 -0.456931 0.028126 -0.721552 0.409768 0.392825 0.459833 0.055212 -0.371712 -0.408433 -0.384734 -0.395974 -0.397375 -0.390903 -0.227471 -0.244020 -0.265675 -0.226607 -0.235538 0.133700 -0.249859 -0.241992 -0.246507 0.487243 -0.317898 -0.437445 -0.196902 -0.182044 -0.121011 0.253732 0.223740 0.385199 0.274122 0.245048 0.230342 0.293402 0.266062 0.252204 0.222798 0.222215 0.221276 0.222182 0.236089 0.235117 0.225485 0.224247 0.330529 0.318687 0.228998 0.258690 0.257326
chargesum: 0.00000
title: Mulliken charges with hydrogens summed into heavy atoms:
elementType: Cl O O N C C C C C C C C C C C C C C C C C C C C C C C C C C C
charge: -0.053056 -0.109409 -0.325951 -0.126402 0.028126 -0.244081 0.409768 0.392825 0.459833 0.055212 -0.097590 -0.163385 -0.154392 -0.102571 -0.131313 -0.138699 -0.004673 -0.021805 -0.044399 -0.004425 0.000551 0.133700 -0.014742 -0.016507 -0.022260 0.487243 0.000789 -0.208447 0.061788 0.075282 -0.121011
polarizability: 4.23963224e+02 4.15881367e+01 3.39151584e+02 5.71775046e+00 1.24168839e+00 2.10912598e+02
1716.lowfreq: -7.2421 -2.2342 0.0009 0.0015 0.0018 1.9048 14.8002 24.3888 33.3502
frequency: 14.7464 24.3766 33.3231 34.5124 40.6319 43.0310 57.9431 68.1267 73.0515 93.6195 121.8656 137.0257 150.5357 154.9903 192.8330 209.5876 230.9696 240.4874 256.0844 278.5698 282.3914 310.0355 346.5356 351.9105 374.2668 395.0759 399.0136 401.6237 404.8574 412.5318 429.7508 446.5124 459.6331 502.8620 510.2793 518.8751 534.8567 578.6066 603.2945 615.8972 617.0598 620.2726 634.1365 645.0821 667.8982 679.1707 695.7675 700.5452 703.6974 707.0341 709.0154 754.4318 758.7274 766.0246 776.6107 785.6250 800.4622 815.4583 832.2723 846.3893 852.6933 856.5406 859.3937 874.7518 892.1057 918.7377 922.2975 940.0541 950.0664 962.5868 975.8665 981.8596 983.0942 984.7699 989.4803 990.3275 994.0754 995.2183 998.0367 1003.1429 1027.4751 1028.5172 1031.8632 1048.2684 1069.1603 1075.8952 1079.4505 1094.3501 1115.7659 1129.7070 1159.3398 1169.1667 1170.0190 1179.1747 1182.7802 1185.1029 1185.5976 1191.6113 1208.7653 1217.5244 1246.8419 1263.2007 1294.8173 1298.5357 1307.7436 1309.3102 1315.6382 1369.6849 1377.9394 1379.5279 1381.4810 1399.4063 1422.6650 1429.8115 1432.5571 1438.0608 1467.3323 1475.0271 1477.0177 1479.9615 1482.3007 1504.3868 1566.1251 1583.3706 1588.3768 1590.5710 1596.3224 1604.7884 1606.9131 1608.6029 1611.0290 3007.3611 3069.0503 3117.0015 3117.6667 3119.1353 3122.7927 3125.7217 3127.1073 3135.3258 3138.7135 3139.6609 3149.0272 3154.5747 3156.1889 3166.7844 3167.4222 3169.1758 3174.6834 3177.1656 3179.2666 3202.9891 3522.3363
redmass: 7.2881 4.7187 5.1155 3.9781 4.6611 5.8182 4.9017 5.9199 5.9596 5.7832 6.2631 5.5383 6.3882 6.4351 5.1271 6.4774 4.9086 6.1316 5.2202 5.6668 5.6044 5.7356 5.5051 5.7836 7.5433 4.3036 4.1707 2.8877 2.8819 3.0603 3.9065 4.4461 3.4096 3.2214 3.2101 4.1587 4.0630 5.5491 3.7815 6.3805 6.4032 6.7987 5.6947 5.2513 1.8315 2.4506 4.4416 3.4630 1.8972 2.2574 2.4292 1.8119 1.8808 1.3088 2.2326 2.4710 2.9740 1.3916 4.0723 1.4074 1.2858 2.3455 1.2898 6.0789 1.5318 1.5630 1.6177 1.3587 2.4301 1.5179 1.3809 1.4136 1.3766 2.4440 6.1078 5.0990 4.2489 1.3533 1.3560 1.3642 2.1556 2.2068 3.7504 2.5180 3.4510 2.2078 1.7259 1.7816 1.3920 1.9550 1.8245 1.0802 1.0787 1.2011 1.5567 1.1418 1.1136 1.4782 2.4341 1.5353 3.2635 1.7602 1.5000 1.4161 1.3585 1.3509 1.3469 5.2490 7.7022 7.2139 7.4883 4.4801 1.5387 2.1836 2.1501 1.7795 1.2993 2.1564 2.1992 2.0269 2.4800 2.4402 5.4040 6.7489 6.0901 6.3591 4.4850 6.3472 6.0914 5.9150 6.0674 1.0597 1.1022 1.0844 1.0843 1.0877 1.0903 1.0880 1.0878 1.0879 1.0939 1.0934 1.0939 1.0969 1.0991 1.1006 1.0980 1.0915 1.0949 1.0831 1.0820 1.0951 1.0764
irintensity: 0.0829 0.3727 0.0594 0.2782 0.3686 0.2514 0.0834 0.9391 1.7559 1.1094 1.1361 1.9610 2.1553 1.9244 0.4019 3.6343 0.4317 0.9693 0.2959 3.0264 8.4690 5.5890 1.8102 4.6909 11.7588 30.8845 0.7941 0.0838 0.0687 0.3416 18.6257 6.3651 8.7971 9.6003 13.6400 13.5561 7.6502 15.4024 18.7373 1.3528 0.0101 3.5324 8.2571 22.7053 32.1224 31.0169 7.4766 15.2453 47.6191 36.5784 53.7631 75.8877 32.8389 191.9323 55.9158 16.5739 49.3490 39.4146 6.2538 56.2483 0.8943 5.7110 0.7327 20.3759 0.5314 12.3781 5.2410 0.7382 10.1312 3.0277 0.1528 0.2525 1.6139 14.7351 0.9151 0.4435 35.6970 0.3251 0.2693 2.1291 8.2061 12.5073 21.7023 14.5115 46.8618 19.0206 0.7073 4.6627 15.4850 2.9862 17.6875 0.5617 0.7334 8.3021 12.0198 2.6070 1.3390 0.2179 3.5937 6.5575 15.0392 73.7540 5.9849 37.1396 6.6013 16.8414 1.8558 176.6123 1.7111 2.0783 2.2061 31.4237 34.0279 3.6242 2.3278 52.3423 23.9310 62.1138 30.2694 19.4027 74.4872 663.4461 108.5020 71.9491 2.8436 1.7298 17.2372 1.6567 8.1059 42.9491 0.9429 17.4816 16.4055 2.5831 4.1123 7.1622 11.8439 4.4269 6.6507 1.9692 30.6157 41.3600 16.6687 32.6982 53.0872 30.4788 19.1652 1.7531 18.4451 553.6454 476.3244 7.1733 16.4410
temp: 298.150 k
press: 1.00000 atm
elementType: 17 8 8 7 6 6 6 6 6 6 6 6 6 6 6 6 6 6 6 6 6 6 6 6 6 6 6 6 6 6 6 1 1 1 1 1 1 1 1 1 1 1 1 1 1 1 1 1 1 1 1 1 1
symmnumber: 1
zpe: 1086651.4 jmol-1
zpe.correction: 0.413884 hartree
zpe.thermalcorrener: 0.440088 hartree
zpe.thermalcorrenthalpy: 0.441033 hartree
zpe.thermalcorrgfe: 0.354528 hartree
zpe.sumelectzpe: -1705.210218 hartree
zpe.sumelectthermal: -1705.184013 hartree
zpe.sumelectthermalent: -1705.183069 hartree
zpe.sumelectthermalfe: -1705.269574 hartree
dipole: 0.7399 -4.3614 -3.1946
dipole: 5.4566
quadrupole: -194.8196 -165.7745 -184.0049
quadrupole: -7.5545 1.2109 2.0266
quadrupole: -13.2866 15.7585 -2.4719 -7.5545 1.2109 2.0266
hfenergy: -1705.6241019 hartree
pointgroup: C01 [X(C27H22Cl1N1O2)]
dipole: -0.2253305 1.6691914 -1.3310721 debye
polarizability: 427.9779668|35.8753148|334.2449672|-13.1155391|-7.6245446|211.8044705 unknown
InChI: InChI=1S/C27H22ClNO2/c28-23-15-17-24(18-16-23)29-26(30)25-14-8-7-9-20(25)19-27(31,21-10-3-1-4-11-21)22-12-5-2-6-13-22/h1-18,29,31H,19H2
charge 0 multiplicity 1
53 atoms
Cl -8.377158 -0.894254 0.544324
O  1.164109 -0.428851 1.408473
O  -1.427491 -0.06531 0.747145
N  -2.854124 1.443056 -0.321351
C  1.809231 -0.731632 0.134659
C  1.036114 0.001176 -1.035731
C  1.813534 -2.265233 -0.093209
C  3.259212 -0.204903 0.229468
C  0.767848 1.474483 -0.773365
C  -0.476097 1.960551 -0.263076
C  1.96526 -3.104134 1.041016
C  4.211462 -0.527159 -0.771095
C  1.703017 -2.868045 -1.371588
C  3.648818 0.627961 1.304559
C  1.772881 2.426568 -1.082914
C  -0.668882 3.355657 -0.057244
C  2.009022 -4.50693 0.901109
C  5.523923 -0.009648 -0.708454
C  1.742413 -4.274812 -1.513941
C  4.965403 1.139553 1.373107
C  1.579237 3.808299 -0.875742
C  -1.598107 1.025611 0.100016
C  0.352951 4.279045 -0.354211
C  1.898763 -5.100524 -0.37909
C  5.906872 0.828957 0.365613
C  -4.1263 0.845006 -0.08583
C  -4.301943 -0.339203 0.679451
C  -5.258657 1.487189 -0.656692
C  -5.598828 -0.862189 0.86873
C  -6.552802 0.963472 -0.469367
C  -6.706114 -0.209396 0.295797
H  0.090607 -0.546465 -1.196206
H  1.635987 -0.089783 -1.95893
H  0.162742 -0.417356 1.271421
H  2.031181 -2.634871 2.027408
H  3.938049 -1.203687 -1.589478
H  1.57371 -2.253444 -2.269487
H  2.907371 0.855749 2.074589
H  2.725999 2.067687 -1.485728
H  -1.605085 3.715554 0.386998
H  2.126428 -5.1389 1.789052
H  6.249934 -0.27033 -1.487331
H  1.649129 -4.722851 -2.510104
H  5.254523 1.78076 2.214042
H  2.38337 4.512741 -1.114085
H  0.198716 5.347879 -0.172335
H  1.929999 -6.190546 -0.488702
H  6.927416 1.225362 0.419325
H  -2.861585 2.282647 -0.906417
H  -3.432109 -0.837385 1.109007
H  -5.134121 2.401334 -1.250708
H  -5.738458 -1.773231 1.457411
H  -7.42247 1.459172 -0.909313
