program: Gaussian 09
title: 000290603
version: EM64L-G09RevD.01
frameworkgroup: C1[X(C8H9ClN2)]
method: RPBEPBE
basis: SDD
operation: Freq
keyword: #p
keyword: freq=noraman
keyword: PBEPBE/SDD
title: #p freq=noraman PBEPBE/SDD
converged: YES YES NO NO
title: Mulliken charges:
elementType: Cl N N C C C C C C C C H H H H H H H H H
charge: -0.071343 -0.022171 -0.596101 0.367264 0.075861 -0.378755 -0.355537 -0.228946 -0.223204 -0.805575 -0.099900 0.214180 0.276248 0.250349 0.250989 0.239694 0.228116 0.248006 0.325234 0.305591
chargesum: 0.00000
title: Mulliken charges with hydrogens summed into heavy atoms:
elementType: Cl N N C C C C C C C C
charge: -0.071343 -0.022171 0.034723 0.367264 0.075861 -0.164575 -0.079289 0.021403 0.027785 -0.089759 -0.099900
polarizability: 2.07864486e+02 1.00283853e+01 1.06808523e+02 6.86231673e-01 -1.17142430e+00 4.74479715e+01
1716.lowfreq: -9.8988 -3.2108 -0.0030 -0.0019 -0.0014 5.4606 32.2051 71.4644 102.6124
frequency: 32.1871 71.4436 102.6021 144.6709 208.4119 262.8022 295.2159 303.0834 335.9287 348.6504 408.2780 426.6966 447.7422 488.1154 515.1529 604.1281 625.9782 653.4810 712.8813 741.9230 815.6541 841.5209 937.0940 942.2451 983.0732 992.8920 1026.9905 1058.2383 1076.9082 1109.1717 1151.7574 1188.4608 1207.9770 1293.6670 1339.7013 1359.3276 1390.2603 1401.9063 1464.7327 1477.8209 1494.0394 1549.0461 1576.5986 1599.8527 1643.4813 2952.3308 3016.6317 3118.1456 3146.7130 3155.9334 3170.6403 3177.1909 3467.8829 3683.8523
redmass: 2.9477 4.9212 1.2639 4.8600 5.1686 5.2451 6.5183 1.2412 4.9129 2.5774 2.9289 1.8255 3.4444 6.5041 2.3387 2.0202 6.9913 3.4775 3.3403 4.7014 1.3612 1.4409 2.1300 1.3830 1.3584 4.0162 1.5290 3.1490 2.1357 1.5529 2.9580 1.1954 1.5464 1.2613 3.6026 4.1863 1.5282 2.7065 1.3073 1.1765 1.5821 7.4261 6.8496 6.3532 1.1210 1.0418 1.0973 1.0926 1.0870 1.0884 1.0958 1.0968 1.0477 1.0984
irintensity: 0.1290 2.3816 4.9086 2.0248 3.8806 8.9315 5.4054 238.8272 20.7818 30.2392 0.1033 40.8014 6.7331 27.3100 9.9342 3.6295 0.2209 6.8176 2.2334 11.4380 25.0085 53.8203 12.1237 0.6415 2.2226 30.6754 2.0030 6.8817 55.9119 27.4847 98.6043 12.0952 8.2675 1.0614 11.1450 11.3938 16.8033 16.9956 52.8258 26.7098 43.9814 124.1216 33.6022 14.7997 22.0725 27.1871 24.2579 9.3345 13.1235 1.3365 12.3644 1.4854 26.4431 61.3678
temp: 298.150 k
press: 1.00000 atm
elementType: 17 7 7 6 6 6 6 6 6 6 6 1 1 1 1 1 1 1 1 1
symmnumber: 1
zpe: 403985.6 jmol-1
zpe.correction: 0.153870 hartree
zpe.thermalcorrener: 0.164840 hartree
zpe.thermalcorrenthalpy: 0.165784 hartree
zpe.thermalcorrgfe: 0.116269 hartree
zpe.sumelectzpe: -878.982267 hartree
zpe.sumelectthermal: -878.971297 hartree
zpe.sumelectthermalent: -878.970353 hartree
zpe.sumelectthermalfe: -879.019868 hartree
dipole: -5.1024 1.1892 0.0125
dipole: 5.2391
quadrupole: -59.0120 -63.7110 -76.3861
quadrupole: -0.1842 0.3418 -0.4004
quadrupole: 7.3577 2.6587 -10.0164 -0.1842 0.3418 -0.4004
hfenergy: -879.1361372 hartree
pointgroup: C01 [X(C8H9Cl1N2)]
dipole: -1.9990148 0.4953282 0.0852981 debye
dipolederiv: -1.0120315 0.0454756 0.037745 0.069333 -0.1406461 0.0013871 0.0396838 0.0018595 -0.0803808 1.2079219 0.5907748 0.0036149 0.3693344 -0.2771577 -0.035273 -0.0763063 -0.0492846 -0.0995892 -1.5539936 -0.572032 -0.0090309 0.0065175 0.0122772 0.0520853 0.0824263 0.0908233 -0.725788 0.6299019 0.1005287 -0.0179189 0.105212 -0.157855 -0.0143118 0.0201081 -0.0037839 0.0135247 -0.0829475 -0.2307916 -0.0116433 -0.6799015 0.2007979 0.0657993 -0.0637623 0.0167337 -0.0576226 -0.1347666 -0.0434148 -0.000224 -0.1325215 0.0495035 -0.0187039 0.0114251 -0.0240392 -0.1710162 -0.1703942 0.0334809 -0.0060327 0.1077126 0.0475741 -0.0170934 0.0003174 -0.0063501 -0.1383626 -0.2522662 0.059626 0.000658 0.1576345 0.0027729 -0.0127166 -0.0172479 -0.0134816 -0.1122899 -0.2431899 -0.0351097 0.0097706 -0.0474353 0.0400802 -0.0121903 0.0105422 -0.0061783 -0.1100322 -0.0916395 0.0897381 0.0157953 0.1050154 -0.1420271 -0.0362756 0.0414882 -0.0206378 0.1347082 1.2469814 -0.077643 -0.0560566 -0.1225797 0.0994252 -0.0061844 -0.0529993 -0.0087432 -0.0795191 0.043546 0.091328 -0.0038336 0.0948892 -0.075186 0.0120624 -0.0032154 0.0146033 0.1469077 0.0741913 -0.079351 0.0140051 -0.040265 0.0153388 0.0139797 0.0168498 0.0100618 0.1507094 0.0315842 -0.076389 0.0117911 -0.0812245 -0.0055176 0.0160763 0.0139393 0.015509 0.1650404 0.0497858 0.0694783 0.0007896 0.0721874 -0.0239629 0.0096465 -0.0003485 0.0100862 0.1619649 0.0003466 0.0820714 -0.0936119 0.004163 0.041357 0.003285 -0.099599 0.064343 -0.0555438 -0.0481194 0.0602318 0.1320537 -0.0373408 0.0707073 0.0469067 0.0985657 -0.0251684 -0.0287647 0.0736136 -0.1553978 -0.0416281 -0.094827 -0.0073304 -0.0260251 -0.0331876 -0.0185037 0.1067381 0.1772264 0.0092772 0.0045777 0.118305 0.1992572 -0.0222344 0.0106666 -0.026468 0.3957329 0.0542492 0.0381182 0.009179 0.0257912 0.0505916 -0.0202197 0.0006537 -0.0213807 0.383583 unknown
polarizability: 207.9277812|8.5912062|106.5602337|-5.6070899|-1.3032501|47.6329657 unknown
InChI: InChI=1S/C8H9ClN2/c1-6(11-10)7-2-4-8(9)5-3-7/h2-5H,10H2,1H3
charge 0 multiplicity 1
20 atoms
Cl 4.329843 -0.253226 -0.118356
N  -2.461317 -0.93553 0.069585
N  -3.827991 -0.927012 0.116825
C  -0.315116 0.121327 0.087027
C  -1.79563 0.213728 0.153471
C  0.512461 1.273163 -0.033034
C  0.327654 -1.153528 0.135298
C  1.92034 1.167524 -0.097638
C  1.727319 -1.275218 0.071668
C  -2.518063 1.541949 0.311063
C  2.510092 -0.106681 -0.042305
H  0.073509 2.273865 -0.094035
H  -0.298422 -2.045586 0.223505
H  2.541664 2.062704 -0.192699
H  2.204605 -2.258811 0.114317
H  -3.097281 1.803192 -0.598664
H  -3.232446 1.500895 1.159521
H  -1.830014 2.373571 0.516727
H  -4.27391 -1.834356 0.038291
H  -4.397197 -0.07907 0.178237
