program: Gaussian 09
title: 000290591
version: EM64L-G09RevD.01
frameworkgroup: C1[X(C31H26)]
method: RPBEPBE
basis: SDD
operation: Freq
keyword: #p
keyword: freq=noraman
keyword: PBEPBE/SDD
title: #p freq=noraman PBEPBE/SDD
converged: YES YES NO NO
title: Mulliken charges:
elementType: C C C C C C C C C C C C C C C C C C C C C C C C C C C C C C C H H H H H H H H H H H H H H H H H H H H H H H H H H
charge: 0.166174 -0.301921 -0.731473 0.374120 -0.462298 0.391334 -0.243887 0.487111 0.274125 -0.334912 -0.391591 -0.368549 -0.460941 -0.356507 -0.376859 -0.388634 -0.248992 -0.263424 -0.239308 -0.254600 0.490994 -0.247789 -0.244141 -0.239204 -0.249633 -0.244029 -0.401798 -0.413440 -0.238111 -0.243615 -0.247739 0.232869 0.243965 0.242745 0.251266 0.226124 0.224789 0.252542 0.233921 0.231148 0.247889 0.227607 0.242969 0.222448 0.223104 0.222960 0.223972 0.225838 0.226412 0.225196 0.224521 0.229499 0.222747 0.226901 0.223888 0.225564 0.228651
chargesum: 0.00000
title: Mulliken charges with hydrogens summed into heavy atoms:
elementType: C C C C C C C C C C C C C C C C C C C C C C C C C C C C C C C
charge: 0.166174 -0.069052 -0.244763 0.374120 -0.211032 0.391334 -0.017762 0.487111 0.274125 -0.110123 -0.139049 -0.134628 -0.229793 -0.108618 -0.149252 -0.145665 -0.026544 -0.040320 -0.016348 -0.030628 0.490994 -0.021951 -0.017729 -0.014008 -0.025112 -0.014530 -0.179051 -0.186539 -0.014223 -0.018051 -0.019088
polarizability: 4.26148174e+02 1.46984168e+01 3.78513882e+02 -3.27802490e+01 -1.60184222e+01 2.25254147e+02
1716.lowfreq: -5.2288 0.0002 0.0005 0.0008 3.6551 8.2053 17.8670 24.4587 30.5710
frequency: 17.4511 24.2141 30.4559 37.2341 40.2098 44.4104 51.3456 54.8723 69.5269 83.7032 115.1412 122.8919 148.9382 182.4152 199.7054 231.3492 247.2102 248.1659 249.8748 260.1641 297.5019 323.8364 379.4091 394.0881 401.7194 402.6369 403.1484 408.5267 429.6097 448.6574 487.4692 496.8945 508.3204 534.7095 550.1953 580.0518 593.5530 615.5774 615.9902 616.3780 617.2396 631.3319 653.9547 691.8190 696.3235 700.9050 704.6045 708.3167 717.1732 754.2490 764.0021 766.4980 784.0685 811.7988 823.9310 841.6357 846.3973 846.8895 848.9853 855.7788 867.4521 870.7153 894.1937 917.1736 919.7247 923.0983 928.4478 973.8230 975.0842 976.8931 977.8570 981.9649 986.1212 987.4847 989.2349 990.7386 991.0021 993.2489 994.8612 996.4090 997.7880 1002.6227 1008.2218 1027.2316 1027.9568 1034.1307 1036.7118 1063.5987 1080.2345 1083.9409 1085.7147 1088.6133 1135.3442 1165.5843 1171.5659 1172.2436 1173.1394 1174.1234 1180.3034 1189.4893 1191.7390 1195.5539 1204.6355 1211.2392 1226.4744 1243.5437 1252.7022 1272.9153 1282.5566 1295.8693 1308.2963 1312.0408 1330.2914 1335.2612 1340.0835 1341.4443 1374.4169 1379.2697 1384.4547 1385.6636 1432.2290 1438.1676 1439.9306 1442.7997 1473.3708 1483.3414 1483.8496 1486.0167 1489.6243 1580.5249 1584.2230 1586.5015 1590.8678 1608.4427 1612.1328 1612.7402 1614.0780 1636.9214 1661.0195 2922.1614 2971.1297 3034.0269 3080.1415 3094.3986 3105.3142 3116.6482 3120.1395 3121.4914 3123.0581 3123.2270 3129.0178 3130.1732 3132.5956 3136.4451 3141.9460 3143.5172 3146.5733 3147.0419 3147.7499 3150.8182 3155.9595 3160.5046 3163.8493 3165.2854 3165.7353
redmass: 3.6671 5.3162 5.3760 4.0104 4.9055 4.6620 4.6084 4.0386 3.9337 3.9607 4.3631 4.7242 4.8173 5.2223 4.8546 4.3409 2.8871 4.0593 3.7813 3.7600 3.4991 4.6048 3.9807 4.3726 2.8057 2.8319 2.8316 2.8425 3.1927 4.0181 3.5541 3.2043 3.6279 3.0599 3.4595 3.1820 5.0558 6.3373 6.3950 6.4156 6.3867 5.3917 5.6291 2.4997 1.7467 2.0626 2.0464 1.6872 3.3662 1.8438 1.8664 1.7853 2.3136 2.7922 3.8901 2.3290 1.5097 1.3510 1.2929 1.2812 1.8349 2.2261 2.0885 1.4753 1.4741 1.5898 1.5713 1.3971 1.3933 1.4394 1.4128 2.3487 1.8353 4.6290 5.2282 4.1425 2.6104 1.5137 1.4027 1.3778 1.5265 2.6604 2.7352 2.2424 2.1918 2.0415 2.0407 2.1420 1.7664 1.6125 1.6811 1.6788 1.9580 1.7337 1.0537 1.0644 1.0683 1.0814 1.8800 1.1208 1.1173 1.1372 1.1278 1.7871 2.0869 1.3092 1.8128 1.6578 1.8865 1.8464 2.2048 1.2966 1.3781 1.7095 1.3942 1.2566 7.0411 6.8353 6.8030 6.0088 2.2331 2.3599 2.2911 2.1810 1.1785 2.0972 2.2496 2.2922 2.1308 5.7172 5.7764 5.8701 6.0279 6.0128 6.0038 5.9927 6.0784 7.6413 6.1769 1.0819 1.0625 1.0981 1.0905 1.0867 1.0879 1.0867 1.0844 1.0855 1.0843 1.0857 1.0872 1.0885 1.0909 1.0910 1.0924 1.0957 1.0959 1.0929 1.0948 1.0955 1.0943 1.1014 1.1015 1.1014 1.1000
irintensity: 0.0063 0.0252 0.1045 0.0496 0.0257 0.0417 0.0056 0.2483 0.0260 0.1108 0.9858 0.4888 0.6883 0.0915 0.3664 0.6553 0.6801 0.1992 0.4473 0.3993 0.1633 0.3779 0.9976 3.0061 0.2563 0.4789 0.0985 0.1213 3.1959 1.3295 16.3396 7.2971 6.2453 1.0582 4.3245 18.2295 8.1896 0.2208 0.0495 0.1950 0.0954 1.5343 4.4819 8.1336 37.2783 46.4031 55.2081 64.7140 14.9834 43.9761 37.9637 91.3371 15.5339 7.4045 3.4610 0.3524 0.8659 0.2618 1.1754 1.5326 13.1655 1.5779 3.1787 0.8062 1.9248 0.8697 4.4743 1.3601 0.2026 0.0358 1.5614 9.3967 10.5037 2.2881 1.0497 0.1882 1.0371 0.8253 0.0136 2.5399 8.0656 8.5418 11.1934 9.2681 7.5384 5.0777 6.2904 7.4308 9.1345 9.4107 1.1619 11.3049 2.2340 1.1391 0.0087 0.3576 0.0478 0.9644 8.5938 1.8186 0.3329 1.3677 0.5715 1.3296 7.0820 6.6927 5.4287 8.5452 20.0966 3.1287 5.0641 2.1272 1.4704 11.2312 1.0724 0.7403 3.1795 0.6536 1.0895 2.5539 7.4551 8.2373 7.0138 10.3080 16.3430 24.4188 18.3170 18.8838 13.8603 2.9179 2.2210 0.8649 0.7066 7.0826 15.6943 16.1540 3.7491 8.1944 1.8263 28.1487 22.3172 18.8648 3.9467 28.8610 14.7700 12.3566 0.9323 1.0011 6.6222 1.9687 1.0795 5.6820 16.2168 11.6060 21.1672 39.8187 44.6418 34.3705 3.7250 49.5533 32.4460 29.8121 31.2226 27.6100 8.5378
temp: 298.150 k
press: 1.00000 atm
elementType: 6 6 6 6 6 6 6 6 6 6 6 6 6 6 6 6 6 6 6 6 6 6 6 6 6 6 6 6 6 6 6 1 1 1 1 1 1 1 1 1 1 1 1 1 1 1 1 1 1 1 1 1 1 1 1 1 1
symmnumber: 1
zpe: 1221397.5 jmol-1
zpe.correction: 0.465206 hartree
zpe.thermalcorrener: 0.490873 hartree
zpe.thermalcorrenthalpy: 0.491817 hartree
zpe.thermalcorrgfe: 0.406348 hartree
zpe.sumelectzpe: -1194.751795 hartree
zpe.sumelectthermal: -1194.726128 hartree
zpe.sumelectthermalent: -1194.725184 hartree
zpe.sumelectthermalfe: -1194.810654 hartree
dipole: -0.1225 -0.0069 -0.0709
dipole: 0.1417
quadrupole: -163.7751 -165.2886 -185.1666
quadrupole: 2.9133 -5.4725 -3.5311
quadrupole: 7.6350 6.1215 -13.7565 2.9133 -5.4725 -3.5311
hfenergy: -1195.2170012 hartree
pointgroup: C01 [X(C31H26)]
dipole: 0.050046 -0.0058304 0.0239051 debye
polarizability: 418.8347077|-12.9826388|377.6940046|-47.5416699|25.5567914|233.3874909 unknown
InChI: InChI=1S/C31H26/c1-5-13-25(14-6-1)21-22-31(29-19-11-4-12-20-29)24-28(26-15-7-2-8-16-26)23-30(31)27-17-9-3-10-18-27/h1-23,30H,24H2
charge 0 multiplicity 1
57 atoms
C  -0.117648 -0.065652 -0.040469
C  0.583108 0.626289 1.245875
C  0.723236 -1.378977 -0.180104
C  2.098163 -1.034555 0.398036
C  1.99964 0.083554 1.17629
C  0.021094 0.835553 -1.297568
C  -1.590474 -0.310095 0.263919
C  0.45013 2.135833 1.382756
C  3.293424 -1.871974 0.170538
C  -0.951683 1.832271 -1.580779
C  1.122519 0.722087 -2.18751
C  -2.296716 -1.438387 -0.025044
C  -0.559346 2.691204 2.210033
C  1.322624 3.021056 0.697137
C  4.597108 -1.432318 0.546007
C  3.174021 -3.153412 -0.43939
C  -0.836898 2.67462 -2.706797
C  1.243484 1.565563 -3.315734
C  -0.70733 4.090814 2.339965
C  1.185114 4.418913 0.829978
C  -3.727833 -1.685947 0.252879
C  0.263774 2.547147 -3.583848
C  0.166008 4.961048 1.648338
C  5.727686 -2.243456 0.33129
C  4.307179 -3.967357 -0.656069
C  5.590416 -3.518522 -0.271179
C  -4.575679 -0.745388 0.907132
C  -4.298447 -2.92611 -0.151653
C  -5.933685 -1.036436 1.143384
C  -5.658641 -3.219701 0.083585
C  -6.48518 -2.275168 0.733621
H  0.082858 0.171047 2.130692
H  0.760866 -1.744462 -1.222709
H  0.264022 -2.182872 0.430325
H  2.804524 0.524492 1.773453
H  -2.104407 0.528944 0.755936
H  -1.813674 1.958594 -0.918901
H  1.902779 -0.023734 -2.008457
H  -1.777063 -2.265343 -0.530733
H  -1.223743 2.021657 2.772202
H  2.104467 2.607083 0.049845
H  4.723621 -0.442405 0.998462
H  2.185716 -3.521261 -0.735802
H  -1.60692 3.430906 -2.897123
H  2.104323 1.450752 -3.984696
H  -1.492836 4.499963 2.985681
H  1.86688 5.08645 0.290783
H  0.35469 3.19791 -4.460881
H  0.058264 6.04693 1.750085
H  6.719432 -1.882752 0.627018
H  4.18841 -4.951311 -1.123731
H  6.471172 -4.147897 -0.439784
H  -4.173083 0.220016 1.233841
H  -3.663433 -3.664112 -0.658112
H  -6.567566 -0.29824 1.648084
H  -6.072708 -4.181703 -0.238805
H  -7.54176 -2.497849 0.91901
