program: Gaussian 09
title: 000290588
version: EM64L-G09RevD.01
frameworkgroup: C1[X(C18H12N2O2)]
method: RPBEPBE
basis: SDD
operation: Freq
keyword: #p
keyword: freq=noraman
keyword: PBEPBE/SDD
title: #p freq=noraman PBEPBE/SDD
converged: NO NO NO NO
title: Mulliken charges:
elementType: O O N N C C C C C C C C C C C C C C C C C C H H H H H H H H H H H H
charge: -0.226422 -0.226421 -0.054097 -0.054097 0.105784 0.105784 0.261228 0.261228 0.288335 0.288335 -0.447365 -0.447365 -0.359470 -0.359470 -0.349958 -0.349959 -0.237971 -0.237971 -0.229705 -0.229705 -0.233294 -0.233294 0.280546 0.280546 0.232249 0.232248 0.268875 0.268875 0.233160 0.233160 0.233477 0.233477 0.234627 0.234627
chargesum: 0.00000
title: Mulliken charges with hydrogens summed into heavy atoms:
elementType: O O N N C C C C C C C C C C C C C C C C C C
charge: -0.226422 -0.226421 -0.054097 -0.054097 0.105784 0.105784 0.261228 0.261228 0.288335 0.288335 -0.166818 -0.166818 -0.127221 -0.127221 -0.081083 -0.081084 -0.004810 -0.004811 0.003773 0.003773 0.001333 0.001333
polarizability: 4.46597061e+02 4.31775938e+00 2.00638210e+02 -1.14266979e-04 2.06692171e-03 8.23633235e+01
1716.lowfreq: -4.2235 -3.1779 -0.0009 0.0003 0.0008 9.1511 20.1030 24.7880 37.2521
frequency: 20.1030 24.7880 37.2521 37.7002 83.4381 84.7904 102.4889 138.5993 177.1092 188.8756 227.0659 288.3966 339.5642 366.9290 382.4526 398.7618 398.8192 436.3437 449.6906 483.0262 485.9666 519.8712 607.6764 614.0942 614.1883 649.3933 666.5596 673.5940 681.7922 693.2227 695.1636 716.5094 775.9379 776.0797 838.9482 845.3391 850.2652 857.3609 862.5419 863.4352 896.6864 910.5013 918.9624 933.2491 933.3125 976.5803 983.7762 983.7906 988.1901 989.0577 992.3207 1000.4493 1003.3267 1003.3375 1030.8765 1030.8801 1079.0226 1082.8885 1107.9835 1175.6932 1176.5015 1186.9452 1194.4410 1196.1241 1233.2099 1236.6076 1317.0205 1325.9884 1326.1430 1338.8240 1381.9529 1385.6553 1415.7921 1439.0321 1440.3216 1474.8187 1475.5982 1550.0234 1574.4238 1580.1942 1590.8636 1593.4337 1620.1241 1620.3239 3131.4329 3131.4479 3139.4898 3139.4939 3151.3910 3151.4007 3162.9698 3162.9849 3173.8332 3173.8828 3253.3021 3253.6884
redmass: 6.3741 3.9249 6.1358 5.3280 5.0718 5.5073 5.7685 5.9160 5.7494 6.5092 4.6946 6.2775 7.7918 6.7273 8.0178 2.7974 2.8005 5.5944 11.7144 3.7608 4.0207 5.0858 8.9630 6.4676 6.4648 5.8593 3.0820 6.5036 6.2074 1.7890 1.9587 3.4637 1.7537 1.7504 14.0861 1.4066 1.3602 1.2964 1.4913 13.6948 8.4094 8.8261 10.0074 1.4283 1.4262 7.5513 1.3868 1.3868 5.9392 6.2994 4.6985 3.7490 1.3299 1.3298 1.9657 1.9396 1.5814 1.6205 1.8894 1.0867 1.0566 1.4736 1.1180 1.1553 4.1434 4.5439 2.3304 2.7382 1.3531 3.0641 7.3235 8.2033 8.6108 2.3405 2.3420 2.4026 2.2886 8.6103 6.3952 6.2810 6.8422 7.1724 6.1796 6.1846 1.0852 1.0852 1.0884 1.0884 1.0935 1.0935 1.0966 1.0966 1.1007 1.1008 1.0993 1.0997
irintensity: 2.2507 0.1634 1.7828 0.0000 0.0000 7.9975 0.0000 1.1355 10.3938 0.0000 0.0000 0.0506 0.7910 0.0000 0.0000 0.0283 0.0000 4.7395 0.0000 12.3023 0.0000 0.0000 2.1852 0.0271 0.0000 0.0000 20.6095 14.1169 0.0000 0.0000 77.4572 0.0000 0.0012 145.0333 67.4751 45.8481 0.0000 19.7790 0.0000 0.0000 27.9042 0.0000 14.1351 0.0001 8.8749 0.0000 0.1213 0.0001 1.6011 0.0000 6.6141 0.0000 0.0006 0.4201 0.6989 20.9658 15.3524 0.0000 3.7845 0.0000 0.0440 0.0000 10.9117 0.0000 4.6953 0.0000 67.1555 0.3437 0.0000 93.2184 0.0000 14.3573 0.0000 0.0000 39.5324 0.0000 129.6022 0.0000 126.5503 0.0000 46.9526 0.0000 0.0001 16.4278 4.5368 0.0491 3.3903 2.0771 47.1477 1.0928 40.7943 0.0033 35.4827 0.0015 9.5912 0.0000
temp: 298.150 k
press: 1.00000 atm
elementType: 8 8 7 7 6 6 6 6 6 6 6 6 6 6 6 6 6 6 6 6 6 6 1 1 1 1 1 1 1 1 1 1 1 1
symmnumber: 1
zpe: 661981.7 jmol-1
zpe.correction: 0.252136 hartree
zpe.thermalcorrener: 0.269245 hartree
zpe.thermalcorrenthalpy: 0.270189 hartree
zpe.thermalcorrgfe: 0.203943 hartree
zpe.sumelectzpe: -951.497206 hartree
zpe.sumelectthermal: -951.480097 hartree
zpe.sumelectthermalent: -951.479152 hartree
zpe.sumelectthermalfe: -951.545399 hartree
dipole: 0.0000 0.0000 0.0001
dipole: 0.0001
quadrupole: -76.8515 -121.9180 -133.8786
quadrupole: 9.4201 0.0002 0.0000
quadrupole: 34.0312 -11.0353 -22.9959 9.4201 0.0002 0.0000
hfenergy: -951.7493416 hartree
pointgroup: C01 [X(C18H12N2O2)]
dipole: -0.0000009 -0.0000006 0.0000207 debye
polarizability: 446.5987663|4.2689098|200.6365051|-0.0001139|0.0020669|82.3633235 unknown
InChI: InChI=1S/C18H12N2O2/c1-3-7-13(8-4-1)17-11-15(19-21-17)16-12-18(22-20-16)14-9-5-2-6-10-14/h1-12H
charge 0 multiplicity 1
34 atoms
O  -2.471462 1.552078 -0.000438
O  2.472421 -1.551955 -0.000505
N  -1.014845 1.530219 -0.000449
N  1.015804 -1.530096 -0.000544
C  -0.702155 0.202413 -0.000477
C  0.703114 -0.20229 -0.00049
C  -2.954054 0.223361 -0.000468
C  2.955012 -0.223239 -0.000488
C  -4.405367 0.040896 -0.000464
C  4.406325 -0.040772 -0.000479
C  -1.864992 -0.638223 -0.000493
C  1.865951 0.638346 -0.000468
C  -4.960359 -1.269119 -0.000576
C  4.961317 1.269243 -0.000555
C  -5.276906 1.165372 -0.000349
C  5.277864 -1.165248 -0.000393
C  -6.357559 -1.448769 -0.000573
C  6.358517 1.448893 -0.000544
C  -6.673745 0.978262 -0.000347
C  6.674704 -0.978137 -0.000385
C  -7.220498 -0.326707 -0.000459
C  7.221456 0.326831 -0.00046
H  -1.861378 -1.724235 -0.000517
H  1.862339 1.724358 -0.000441
H  -4.299724 -2.143072 -0.000669
H  4.300681 2.143196 -0.000626
H  -4.8509 2.173299 -0.00026
H  4.851859 -2.173175 -0.000332
H  -6.774292 -2.46162 -0.000661
H  6.775251 2.461744 -0.000604
H  -7.33697 1.849934 -0.000258
H  7.33793 -1.849809 -0.000319
H  -8.306597 -0.468739 -0.000457
H  8.307555 0.468863 -0.000453
