program: Gaussian 09
title: 000290587
version: EM64L-G09RevD.01
frameworkgroup: C1[X(C25H29NO3S)]
method: RPBEPBE
basis: SDD
operation: Freq
keyword: #p
keyword: freq=noraman
keyword: PBEPBE/SDD
title: #p freq=noraman PBEPBE/SDD
converged: YES YES NO NO
title: Mulliken charges:
elementType: S O O O N C C C C C C C C C C C C C C C C C C C C C C C C C H H H H H H H H H H H H H H H H H H H H H H H H H H H H H
charge: 0.871084 -0.469024 -0.551804 -0.514088 -0.363067 -0.034001 -0.019965 -0.129784 -0.212348 0.418842 -0.670204 -0.679067 -0.684763 -0.693579 0.326361 0.365330 -0.198509 -0.355047 -0.259651 -0.250928 -0.377423 -0.377859 -0.339852 -0.421914 -0.254899 -0.235505 -0.241979 -0.252602 -0.239196 -0.247017 0.262081 0.213610 0.218338 0.209102 0.236468 0.267350 0.221397 0.199757 0.204950 0.259934 0.214203 0.250447 0.210994 0.258660 0.295169 0.276437 0.243204 0.238658 0.373165 0.257007 0.276464 0.282873 0.262482 0.224738 0.227549 0.225709 0.226381 0.226112 0.229222
chargesum: 0.00000
title: Mulliken charges with hydrogens summed into heavy atoms:
elementType: S O O O N C C C C C C C C C C C C C C C C C C C C C C C C C
charge: 0.871084 -0.095859 -0.551804 -0.514088 -0.363067 0.228080 0.193645 -0.129784 -0.212348 0.418842 -0.006296 0.009438 -0.005676 0.026523 0.326361 0.365330 0.096660 -0.078610 -0.016447 -0.012270 -0.120416 -0.101395 -0.056979 -0.159432 -0.030161 -0.007956 -0.016270 -0.026221 -0.013083 -0.017795
polarizability: 3.63830275e+02 -1.02437198e+01 3.01892279e+02 2.10941418e+00 -3.00304929e+00 2.58553304e+02
1716.lowfreq: -10.0668 -5.5994 -3.7759 -0.0003 -0.0002 0.0006 24.2743 31.5027 32.7845
frequency: 24.0784 31.4838 32.5823 41.4020 51.4212 57.3133 67.8432 71.8164 82.9051 95.7805 104.6721 119.4112 126.7617 147.6115 174.9205 190.4790 193.0181 199.5908 206.5023 215.3971 225.2220 228.4802 239.5934 246.7915 262.3095 269.0483 274.9682 288.9057 293.4460 316.1758 329.0401 347.0692 372.3985 380.7226 393.6634 402.9130 405.5962 409.8826 430.0014 453.2748 474.7329 490.0926 514.5660 524.3606 538.1380 571.1172 578.1852 614.6694 615.7334 620.3408 632.4793 644.1439 694.1285 705.2790 708.4021 725.3671 751.7292 763.5766 764.9892 769.4929 772.6763 842.1018 857.5105 860.0059 865.6312 879.9558 885.9979 895.7981 902.8383 917.6479 919.8520 924.6145 938.9989 939.7734 940.9558 942.2869 958.2411 974.3706 982.3716 983.0396 986.7289 989.0184 990.3400 996.2806 998.0118 1001.0475 1004.4364 1027.9569 1029.5210 1052.9025 1082.0364 1091.2152 1108.9883 1110.8048 1128.2452 1132.8044 1151.0302 1155.5574 1167.5065 1170.4849 1171.5635 1171.7163 1181.8890 1184.5743 1190.4882 1191.3605 1193.6151 1272.0251 1284.1937 1301.1783 1312.8065 1316.0156 1329.6383 1347.3016 1372.2386 1375.5103 1377.3802 1377.6600 1378.4079 1395.2083 1396.0355 1405.3413 1418.0502 1432.8262 1435.0229 1449.4037 1455.0602 1462.2939 1464.6472 1471.8897 1476.4094 1477.5899 1479.4657 1480.0633 1489.9383 1496.5586 1560.1142 1588.3384 1590.3993 1594.0656 1606.0358 1610.1237 2982.0564 2983.1118 2984.4876 2986.8138 2994.7326 2995.1742 3028.5805 3073.0832 3080.0942 3081.0777 3088.7963 3096.9411 3101.5107 3103.4433 3113.1794 3116.4494 3122.2918 3128.0189 3133.1767 3138.7122 3139.0464 3146.3361 3153.1136 3154.9227 3159.3218 3165.5133 3165.7414 3175.4795 3176.2762
redmass: 4.1773 4.5359 3.8850 4.0971 5.5990 4.2442 4.4788 4.2442 4.5986 2.6784 2.9406 5.4631 4.2114 4.4571 2.8713 6.3279 1.3513 2.6825 1.3756 2.5888 1.5908 4.0492 4.7742 2.3994 3.1585 4.4685 1.4725 4.9988 3.9176 3.2680 5.8080 3.3480 2.9595 4.1961 4.4268 2.9149 3.2277 5.5976 3.7107 4.2445 4.0261 4.0403 3.9097 3.9856 4.0643 2.8085 4.2882 6.3933 6.3768 6.3542 5.3818 6.0681 6.5393 1.7570 1.8231 4.2863 3.7891 1.6284 1.4776 1.9144 8.2885 2.7556 1.2567 1.2728 1.5002 1.8949 2.4400 2.3735 3.5079 2.0284 1.3162 1.4258 1.5252 1.3544 1.3879 1.6570 1.4206 6.0829 2.2789 1.4410 1.5514 4.1332 5.8194 1.5192 1.4820 1.3545 2.8112 2.2600 2.1712 2.6446 1.5973 1.6669 1.6377 2.1339 2.2414 2.3177 2.3446 2.2308 2.4923 1.0625 1.0864 1.9445 1.2812 1.2965 2.1560 1.1978 1.8546 1.4600 1.3790 1.3734 1.3386 1.3336 1.2430 4.8501 1.1938 1.2293 5.9336 1.2387 6.3163 1.2018 1.2026 1.4539 1.9696 2.2198 2.0307 2.1676 1.0466 1.0485 1.0477 1.0441 1.8402 1.1531 2.1500 1.0639 1.0470 1.0518 5.6004 6.2024 6.2130 6.4336 6.0210 6.0650 1.0362 1.0576 1.0404 1.0596 1.0732 1.0416 1.0704 1.0994 1.0989 1.0986 1.0988 1.1005 1.1006 1.1006 1.1000 1.0850 1.0846 1.0877 1.0888 1.0865 1.0928 1.0935 1.0957 1.0898 1.0986 1.0936 1.0992 1.1000 1.0964
irintensity: 0.1884 0.2492 0.1565 0.5431 0.5752 0.3618 0.5019 0.1725 0.8817 0.1705 0.6616 0.3430 0.3487 2.2367 0.7014 5.2082 0.4895 2.8811 3.7049 5.6641 1.4177 0.7269 0.6678 0.2621 1.9904 4.6023 3.6883 2.7544 1.7245 3.4510 6.3859 7.8022 4.0425 2.7018 9.7902 0.6551 4.7152 2.4750 32.3836 14.7792 29.4316 27.8079 3.6843 0.3765 93.1242 6.4813 13.4780 0.6208 0.2140 8.9188 17.3502 9.8721 1.0897 43.5790 62.6381 2.5285 11.6167 58.3790 66.9617 29.7237 127.3043 2.5563 18.9157 18.5489 1.8699 94.1799 87.1148 0.1627 57.0946 10.7245 4.8360 4.2029 4.0470 3.9240 0.0400 3.3145 0.3283 12.6222 13.6293 0.3850 2.5082 0.4747 1.3180 8.7913 4.5586 1.9637 25.8174 3.3575 14.6782 1.7583 2.1373 2.5491 19.6379 7.3387 8.7852 38.2984 29.1474 19.3271 12.0275 0.0979 0.1795 20.8047 5.5363 10.4385 25.8625 4.4959 4.4744 2.1747 1.7670 7.7191 2.6909 1.3139 31.0340 15.3985 3.5908 1.1220 2.9562 45.0901 9.5810 32.6860 28.7981 74.3700 31.2062 13.6863 29.6743 24.9547 1.3577 7.6747 2.4589 23.3722 9.5860 6.3514 18.4138 5.4665 6.7810 26.5074 4.5053 0.6087 0.3854 5.4820 8.3026 2.7959 10.7413 26.4104 28.1197 26.2393 6.5029 41.6296 758.4900 1.6280 26.4530 69.3257 26.3273 16.6711 12.8766 17.1303 11.9815 2.4379 0.0657 2.5700 11.2944 5.1889 23.3123 26.3022 19.5060 5.6889 29.3803 2.1623 17.2014 15.6353 10.3802
temp: 298.150 k
press: 1.00000 atm
elementType: 16 8 8 8 7 6 6 6 6 6 6 6 6 6 6 6 6 6 6 6 6 6 6 6 6 6 6 6 6 6 1 1 1 1 1 1 1 1 1 1 1 1 1 1 1 1 1 1 1 1 1 1 1 1 1 1 1 1 1
symmnumber: 1
zpe: 1252475.4 jmol-1
zpe.correction: 0.477043 hartree
zpe.thermalcorrener: 0.507111 hartree
zpe.thermalcorrenthalpy: 0.508055 hartree
zpe.thermalcorrgfe: 0.416359 hartree
zpe.sumelectzpe: -1646.159573 hartree
zpe.sumelectthermal: -1646.129504 hartree
zpe.sumelectthermalent: -1646.128560 hartree
zpe.sumelectthermalfe: -1646.220257 hartree
dipole: -1.4502 1.6335 6.0713
dipole: 6.4523
quadrupole: -169.1725 -177.9735 -187.6243
quadrupole: -7.8158 -1.8901 -6.8496
quadrupole: 9.0843 0.2833 -9.3675 -7.8158 -1.8901 -6.8496
hfenergy: -1646.6366152 hartree
pointgroup: C01 [X(C25H29N1O3S1)]
dipole: 0.8422962 0.0820638 -2.3933072 debye
polarizability: 362.1791355|12.2899205|301.3132476|11.3664758|-5.7503722|260.7834747 unknown
InChI: InChI=1S/C25H29NO3S/c1-19(2)26(20(3)4)30(28,29)24-18-12-11-17-23(24)25(27,21-13-7-5-8-14-21)22-15-9-6-10-16-22/h5-20,27H,1-4H3
charge 0 multiplicity 1
59 atoms
S  1.924158 -0.608018 1.474891
O  -1.287986 0.066057 1.936586
O  1.226104 0.768949 2.068757
O  2.451577 -1.697284 2.558808
N  3.351375 -0.230085 0.330247
C  2.964869 0.827259 -0.676622
C  4.686415 -0.098575 1.034758
C  -1.456442 -0.04796 0.488845
C  0.754395 -1.534755 0.226581
C  -0.606737 -1.244997 -0.066862
C  3.749243 0.538778 -1.977778
C  3.119374 2.293627 -0.209741
C  5.345821 -1.487747 1.165316
C  4.674296 0.663832 2.385202
C  -2.973547 -0.328434 0.313968
C  -1.068074 1.270169 -0.228091
C  1.451333 -2.645411 -0.292095
C  -1.219068 -2.158935 -0.972139
C  0.799352 -3.522854 -1.181577
C  -0.545664 -3.269243 -1.520374
C  -3.723227 0.173427 -0.776393
C  -1.261631 2.497515 0.454798
C  -3.6237 -1.135024 1.282257
C  -0.603391 1.298385 -1.566124
C  -5.100046 -0.12755 -0.90075
C  -0.984786 3.725012 -0.183271
C  -4.996995 -1.435472 1.158598
C  -0.328922 2.528792 -2.208641
C  -5.741917 -0.935787 0.063894
C  -0.516717 3.74734 -1.518693
H  1.892168 0.656017 -0.893841
H  5.280023 0.49986 0.314061
H  3.407135 1.22743 -2.771854
H  4.835029 0.695831 -1.842242
H  3.584922 -0.50003 -2.310712
H  2.522648 2.478487 0.698945
H  2.748102 2.966785 -1.003475
H  4.17653 2.552007 -0.013876
H  6.378177 -1.381921 1.548298
H  4.77538 -2.120075 1.865945
H  5.387908 -1.990299 0.182856
H  4.179889 1.64516 2.303022
H  5.716126 0.82478 2.717524
H  4.15607 0.074984 3.161085
H  2.492962 -2.81441 -0.004619
H  -2.266542 -1.989913 -1.235283
H  1.334005 -4.387147 -1.58792
H  -1.079325 -3.93721 -2.204926
H  -0.36188 0.439737 2.137357
H  -3.242175 0.813168 -1.523492
H  -1.629039 2.472946 1.485673
H  -3.045034 -1.493795 2.137674
H  -0.462623 0.360304 -2.115939
H  -5.668479 0.275332 -1.746768
H  -1.13664 4.664962 0.359339
H  -5.487392 -2.054817 1.918282
H  0.023616 2.532521 -3.246761
H  -6.809198 -1.166534 -0.030354
H  -0.306428 4.701731 -2.014653
