program: Gaussian 09
title: 000290572
version: EM64L-G09RevD.01
frameworkgroup: C1[X(C7H6ClFO2S)]
method: RPBEPBE
basis: SDD
operation: Freq
keyword: #p
keyword: freq=noraman
keyword: PBEPBE/SDD
title: #p freq=noraman PBEPBE/SDD
converged: NO YES NO NO
title: Mulliken charges:
elementType: Cl S F O O C C C C C C C H H H H H H
charge: 0.044718 1.089001 -0.333891 -0.482935 -0.453731 -0.012625 0.479823 -0.388382 -0.144367 -0.378914 -0.170726 -0.790531 0.301401 0.249963 0.268944 0.240915 0.232460 0.248878
chargesum: 0.00000
title: Mulliken charges with hydrogens summed into heavy atoms:
elementType: Cl S F O O C C C C C C C
charge: 0.044718 1.089001 -0.333891 -0.482935 -0.453731 -0.012625 0.479823 -0.086981 -0.144367 -0.128951 0.098218 -0.068279
polarizability: 1.53525480e+02 8.29219542e+00 1.28645611e+02 -4.38668109e+00 5.63758040e-01 6.42732715e+01
1716.lowfreq: -11.9226 -0.0025 -0.0023 -0.0006 5.9437 8.3805 10.1437 45.9885 89.6957
frequency: -11.4617 45.9696 89.6728 110.5751 131.8833 191.9692 197.8405 214.8913 264.0707 296.9262 302.5989 322.2475 363.7671 422.4279 446.0164 448.4295 532.1754 564.6845 618.0408 655.6767 687.0858 816.3387 830.2790 860.1707 901.4143 971.7500 987.8048 990.8166 1007.6015 1051.0903 1104.3784 1146.6079 1219.3538 1258.3572 1354.5524 1392.4925 1403.4091 1462.9820 1467.6382 1474.1871 1557.4993 1601.3191 2985.7011 3069.3124 3098.3556 3144.1477 3147.4878 3173.4643
redmass: 1.0157 13.0026 5.6691 7.0217 11.3594 6.9497 12.0617 7.1048 10.7241 5.8870 5.6989 7.9813 8.4637 5.4572 3.6350 7.2962 5.0714 9.9196 6.2379 7.3312 3.6723 5.6804 1.3376 15.8802 1.3151 1.3593 5.4402 2.7053 2.3935 1.5559 2.5272 1.5012 2.1515 1.4893 3.3288 4.2864 1.2174 2.7642 1.1056 1.0604 6.0142 6.6742 1.0391 1.0951 1.1002 1.0899 1.0920 1.0959
irintensity: 0.7683 0.0794 0.4412 0.3203 0.7182 5.0796 0.2347 0.3453 6.3019 1.8281 4.4828 3.2627 12.4934 17.7636 21.9726 48.7979 64.0003 67.2166 8.9566 4.2582 2.4191 18.4325 32.1084 79.6136 5.0696 1.4873 63.1432 13.9037 4.7286 18.2510 39.7971 5.7878 0.1419 7.9308 5.3846 4.6644 15.5728 86.1564 12.6811 15.2539 2.8017 1.8135 17.1941 14.2134 11.4193 5.4543 9.8849 2.3226
temp: 298.150 k
press: 1.00000 atm
elementType: 17 16 9 8 8 6 6 6 6 6 6 6 1 1 1 1 1 1
symmnumber: 1
zpe: 301372.0 jmol-1
zpe.correction: 0.114787 hartree
zpe.thermalcorrener: 0.126498 hartree
zpe.thermalcorrenthalpy: 0.127442 hartree
zpe.thermalcorrgfe: 0.076233 hartree
zpe.sumelectzpe: -1377.692853 hartree
zpe.sumelectthermal: -1377.681142 hartree
zpe.sumelectthermalent: -1377.680197 hartree
zpe.sumelectthermalfe: -1377.731407 hartree
dipole: -7.6034 1.6515 -0.4613
dipole: 7.7944
quadrupole: -78.8215 -82.8731 -89.1717
quadrupole: 3.3000 0.2332 0.7693
quadrupole: 4.8006 0.7490 -5.5496 3.3000 0.2332 0.7693
hfenergy: -1377.8076397 hartree
pointgroup: C01 [X(C7H6Cl1F1O2S1)]
dipole: -3.0423088 -0.3555359 0.1472337 debye
dipolederiv: -0.2817157 0.3204007 0.0117864 0.2598217 -0.3921404 -0.0148219 0.0079312 -0.0126238 0.0164298 1.7969742 0.3352192 -0.0252396 0.2652319 1.3406004 0.0673076 -0.0381998 0.0607558 1.554021 -0.5444784 -0.0480142 0.1278954 0.0146836 -0.343651 -0.1404695 0.2793469 -0.0648028 -0.789141 -0.5735189 -0.0553702 -0.0189423 -0.0955069 -0.6161202 -0.0101999 -0.0407985 0.0032715 -0.4106161 -0.6265721 -0.0706331 -0.0692447 -0.0489634 -0.4343543 0.0621048 -0.1095756 0.0258673 -0.4724658 -0.1381952 0.0643479 -0.0005904 -0.0067219 -0.1992431 0.0201056 -0.1190359 -0.027235 -0.1208842 0.2486481 -0.3867911 -0.0196232 -0.2347415 0.1069012 0.007675 -0.0564745 0.0413134 -0.0154924 -0.1906699 0.2346043 0.0029172 -0.2325646 -0.1697321 -0.0039272 0.0433717 0.0147603 -0.09402 0.3550068 -0.7197905 -0.0197136 -0.1207954 0.6091254 0.0359022 0.0103046 0.0154699 -0.0547741 0.1064726 0.0558562 0.0066969 0.1276831 0.0396495 0.0061741 0.0142079 -0.0004485 -0.1300879 -0.2390463 0.2589789 0.008551 0.0222182 -0.0676049 0.0053997 -0.0015893 0.0029139 -0.0687497 -0.0801919 0.1058454 0.0127028 0.0971561 -0.0673303 -0.0082786 0.0843116 -0.0812419 0.0483105 0.1545779 -0.0133589 -0.0057308 0.0128454 0.0589638 -0.0058938 -0.0125495 0.0006414 0.1535164 -0.0781037 -0.041543 -0.0104581 -0.0299467 0.0838441 -0.0013517 -0.0120059 -0.0012392 0.1495573 0.0657527 -0.0211072 -0.0049986 -0.0201207 -0.0155804 -0.0085632 -0.0090206 -0.0098145 0.1635659 0.0518709 -0.0657794 0.0516108 0.0025188 -0.0447349 0.0816156 -0.0045727 0.096736 0.0708991 -0.0717597 -0.0152189 -0.0737839 -0.0797168 0.0411035 -0.0581999 -0.0966753 -0.0095733 0.07572 0.0449485 0.0623538 0.0261647 0.0669193 0.0703037 -0.0345787 0.0610237 -0.0547507 -0.0757889 unknown
polarizability: 151.5774224|-10.7113195|130.4644884|4.8336794|1.8567629|64.4024518 unknown
InChI: InChI=1S/C7H6ClFO2S/c1-5-2-3-6(8)7(4-5)12(9,10)11/h2-4H,1H3
charge 0 multiplicity 1
18 atoms
Cl 1.214065 -2.602489 -0.033839
S  1.926406 0.728027 0.174134
F  2.499545 0.20543 -1.508409
O  1.828689 2.333564 0.146091
O  2.871446 -0.020106 1.229442
C  0.176966 0.026439 0.062248
C  -2.196499 0.585622 -0.005388
C  -0.841681 0.9951 0.055506
C  -0.084119 -1.354547 -0.005547
C  -2.466718 -0.805804 -0.070331
C  -1.432107 -1.76576 -0.070315
C  -3.313686 1.610299 0.019241
H  -0.573576 2.056793 0.094839
H  -3.505618 -1.149244 -0.125197
H  -1.660395 -2.833989 -0.129488
H  -3.024366 2.538641 -0.502321
H  -4.228922 1.220122 -0.457338
H  -3.573331 1.885201 1.059472
