program: Gaussian 09
title: 000290548
version: EM64L-G09RevD.01
frameworkgroup: C1[X(C16H16BrNO3)]
method: RPBEPBE
basis: SDD
operation: Freq
keyword: #p
keyword: freq=noraman
keyword: PBEPBE/SDD
title: #p freq=noraman PBEPBE/SDD
converged: YES YES NO NO
title: Mulliken charges:
elementType: Br O O O N C C C C C C C C C C C C C C C C H H H H H H H H H H H H H H H H
charge: -0.011349 -0.262198 -0.259517 -0.436157 -0.282245 -0.353264 -0.524550 -0.582972 0.605062 0.504819 -0.496149 0.193214 0.187068 -0.412621 -0.294095 -0.203068 -0.384333 -0.391594 -0.387576 -0.347334 0.277732 0.198176 0.220747 0.213332 0.223350 0.199422 0.228870 0.265797 0.270448 0.274525 0.236754 0.244280 0.231885 0.236267 0.216665 0.248757 0.351850
chargesum: 0.00000
title: Mulliken charges with hydrogens summed into heavy atoms:
elementType: Br O O O N C C C C C C C C C C C C C C C C
charge: -0.011349 -0.262198 -0.259517 -0.084306 -0.016449 0.065659 -0.087868 -0.154680 0.605062 0.504819 -0.225701 0.193214 0.187068 -0.412621 -0.019570 0.277966 -0.152447 -0.155327 -0.170911 -0.098577 0.277732
polarizability: 2.97839588e+02 3.27117548e+01 2.18603977e+02 2.85614122e+01 -1.06412087e+01 1.12182633e+02
1716.lowfreq: -14.6918 -4.0797 -3.3764 0.0003 0.0006 0.0008 3.7030 10.1435 20.0561
frequency: -12.7819 10.0159 20.0213 29.5211 53.6295 74.9452 90.6709 96.7868 121.5245 139.2426 155.6272 193.2407 244.3442 249.3259 275.1174 301.1864 304.3226 314.9181 351.5063 375.3105 391.1839 403.7084 410.8098 435.3338 466.0288 499.3156 531.9963 549.1294 629.4793 636.8482 662.0079 678.4966 680.0818 706.6964 717.5630 754.1326 762.0353 791.4490 799.1332 807.0886 826.1124 835.8983 840.5410 851.9914 876.7540 929.2996 933.4337 960.5864 963.1814 979.0867 1001.2816 1005.5724 1034.7696 1067.9539 1068.6700 1070.4507 1109.0870 1118.5464 1126.5077 1141.6644 1149.9652 1166.7705 1179.1245 1213.8178 1219.0074 1237.4031 1246.0153 1254.2426 1271.4472 1281.3605 1319.2470 1330.8482 1358.9777 1375.7331 1382.3616 1390.7907 1413.9427 1425.3776 1446.5460 1462.4003 1475.8836 1483.9198 1486.9026 1494.7375 1505.7859 1598.2734 1603.6795 1621.4649 1627.3110 2861.6649 2897.8138 2976.7829 3003.4493 3005.3607 3008.9569 3050.4206 3108.3826 3112.6466 3124.6981 3134.4929 3169.1489 3177.5044 3195.5304 3416.5589 3582.5334
redmass: 4.2321 7.9190 4.5331 5.6713 6.2597 2.6938 2.9992 6.5205 2.2142 6.2150 7.8728 7.0478 6.5622 6.2367 5.7738 2.8427 6.5433 3.7916 1.1126 5.1690 4.6055 3.1623 2.9490 3.6218 4.2523 3.7948 4.3937 3.5763 5.5283 6.7651 7.7726 9.1973 1.7071 3.3485 3.5634 5.4160 3.8771 4.9921 1.1958 1.4408 2.7442 6.8496 1.9882 1.4794 1.4630 1.8836 2.2681 1.4086 2.1581 2.9970 2.3800 2.5277 2.4693 2.9301 2.2569 1.8547 1.3954 4.3723 1.0617 1.3715 1.2691 1.6225 1.1108 1.8381 1.5258 1.4459 2.9005 4.1323 1.1935 1.3245 1.2559 1.3671 1.4365 1.9968 1.8837 6.1006 6.8991 2.8300 1.1818 2.7743 1.0974 1.2259 1.1185 1.0842 2.7545 6.4481 8.6949 9.1915 6.4692 1.0708 1.0699 1.0646 1.0850 1.0602 1.0891 1.1000 1.0873 1.1114 1.0900 1.0962 1.0952 1.0932 1.0937 1.0743 1.0660
irintensity: 1.3494 0.2473 0.3921 0.0577 0.4351 12.4284 2.0534 3.0826 3.4176 0.6279 1.0484 0.1900 0.2412 2.2889 0.7512 5.0113 1.2081 1.6880 144.5181 0.6553 4.6730 8.9001 2.2351 11.4472 6.1844 12.6716 10.0259 46.9597 7.3524 0.5712 8.0329 0.9350 64.1735 9.8210 2.9188 0.5006 15.5299 30.4484 1.1193 30.4162 14.6281 32.0235 34.9589 11.0734 43.3932 8.1178 14.5330 6.8460 64.6400 82.5216 7.6991 1.7034 8.3941 33.7326 3.9690 30.0416 19.0830 132.6696 1.1614 232.8452 22.2360 4.8853 6.6962 0.8453 1.3580 60.2166 22.5372 128.0042 4.1872 1.7531 6.9571 27.4342 3.7872 21.9395 18.9203 11.9210 11.6732 10.5567 86.3883 208.4279 7.3748 23.2039 4.9689 9.0403 99.2424 8.6823 2.2276 4.6867 29.4376 90.6148 74.7630 24.5992 37.4094 122.5378 25.7062 23.7231 21.8508 29.0561 18.3360 14.4441 6.9190 1.0231 0.8967 0.2735 39.0010
temp: 298.150 k
press: 1.00000 atm
elementType: 35 8 8 8 7 6 6 6 6 6 6 6 6 6 6 6 6 6 6 6 6 1 1 1 1 1 1 1 1 1 1 1 1 1 1 1 1
symmnumber: 1
zpe: 749487.0 jmol-1
zpe.correction: 0.285465 hartree
zpe.thermalcorrener: 0.304487 hartree
zpe.thermalcorrenthalpy: 0.305432 hartree
zpe.thermalcorrgfe: 0.233897 hartree
zpe.sumelectzpe: -911.612332 hartree
zpe.sumelectthermal: -911.593309 hartree
zpe.sumelectthermalent: -911.592365 hartree
zpe.sumelectthermalfe: -911.663899 hartree
dipole: -0.8782 0.4442 -0.5106
dipole: 1.1087
quadrupole: -120.0589 -127.0395 -134.7168
quadrupole: 24.2859 3.1496 -0.8675
quadrupole: 7.2129 0.2323 -7.4451 24.2859 3.1496 -0.8675
hfenergy: -911.8977965 hartree
pointgroup: C01 [X(C16H16Br1N1O3)]
dipole: 0.3398141 -0.2263052 -0.1535891 debye
polarizability: 301.6789581|23.0003601|216.3658285|-30.1179469|-8.7843775|110.5814116 unknown
InChI: InChI=1S/C16H16BrNO3/c17-14-8-16-15(20-10-21-16)7-12(14)9-18-6-5-11-1-3-13(19)4-2-11/h1-4,7-8,18-19H,5-6,9-10H2
charge 0 multiplicity 1
37 atoms
Br 2.103027 -3.145297 0.77196
O  5.247433 2.051076 -0.098438
O  6.375386 -0.043025 -0.424451
O  -7.944081 0.335755 0.32988
N  -0.025711 -0.054886 -0.023273
C  -1.46664 -0.052608 0.312953
C  0.863803 -0.13226 1.16535
C  -2.326982 0.026319 -0.972846
C  2.323944 -0.196476 0.750053
C  -3.814932 0.083697 -0.663944
C  3.027532 1.02876 0.532888
C  4.359621 0.970394 0.131622
C  5.025022 -0.259268 -0.060932
C  3.020247 -1.412573 0.538013
C  4.381042 -1.481084 0.133482
C  6.484185 1.427596 -0.639439
C  -4.572791 -1.100098 -0.482941
C  -4.478677 1.328995 -0.502893
C  -5.945383 -1.051763 -0.152583
C  -5.846939 1.399013 -0.172531
C  -6.580254 0.203508 0.003914
H  -1.777726 -0.948957 0.907077
H  -1.673951 0.833047 0.945579
H  0.622962 -1.00227 1.821482
H  0.695052 0.780675 1.767923
H  -2.101434 -0.857561 -1.603513
H  -2.007181 0.918941 -1.541378
H  0.201685 -0.800989 -0.697952
H  2.512616 1.982674 0.671379
H  4.893564 -2.432757 -0.015765
H  6.544449 1.627199 -1.725563
H  7.352586 1.806543 -0.079503
H  -4.087497 -2.075921 -0.608299
H  -3.915725 2.259892 -0.643622
H  -6.514141 -1.982153 -0.022402
H  -6.360054 2.357882 -0.053102
H  -8.367455 -0.552517 0.431814
