program: Gaussian 09
title: 000290544
version: EM64L-G09RevD.01
frameworkgroup: C1[X(C11H11NO2)]
method: RPBEPBE
basis: SDD
operation: Freq
keyword: #p
keyword: freq=noraman
keyword: PBEPBE/SDD
title: #p freq=noraman PBEPBE/SDD
converged: YES YES NO NO
title: Mulliken charges:
elementType: O O N C C C C C C C C C C C H H H H H H H H H H H
charge: -0.305045 -0.303305 -0.014220 -0.242877 -0.546369 0.241981 0.274377 -0.557302 -0.550045 0.237410 0.232118 -0.158792 -0.528463 -0.529182 0.279675 0.243875 0.256529 0.278239 0.270395 0.225781 0.231399 0.253848 0.231562 0.256423 0.221987
chargesum: 0.00000
title: Mulliken charges with hydrogens summed into heavy atoms:
elementType: O O N C C C C C C C C C C C
charge: -0.305045 -0.303305 -0.014220 0.036798 -0.045965 0.241981 0.274377 -0.279062 -0.279649 0.237410 0.232118 -0.158792 0.182566 0.180789
polarizability: 1.79840388e+02 1.36319889e+00 1.25351758e+02 -1.32470589e-01 4.08040875e+00 8.00160526e+01
1716.lowfreq: -11.8316 -5.7826 -0.0007 -0.0006 -0.0005 6.6404 51.3743 67.7878 93.8347
frequency: 51.3588 67.7394 93.8285 108.0470 141.3918 146.6476 164.1780 170.8850 230.6640 247.2007 283.7778 318.2100 342.4018 360.3854 393.8377 436.1964 490.9467 515.9956 557.1905 620.6953 643.1878 704.0239 720.5039 753.2499 807.9904 823.3682 883.6233 895.2644 909.2183 946.2953 968.0775 1008.3907 1052.0271 1084.4339 1112.0660 1114.8720 1126.5470 1130.2308 1139.5496 1156.6533 1159.5916 1192.7068 1214.3785 1262.1611 1281.1093 1360.2757 1382.8355 1427.1140 1445.0256 1448.4239 1455.5703 1457.9018 1462.7090 1477.5087 1487.4872 1609.1159 1611.5210 2189.2689 2973.5105 2975.2677 3017.7207 3025.0964 3071.7638 3073.2553 3094.7072 3123.4481 3123.6752 3162.7140 3167.3664
redmass: 5.2915 4.0522 4.7227 2.7680 3.1639 2.0829 1.2088 1.3359 3.0755 5.3859 4.8270 6.0238 4.7006 3.9091 7.5149 5.7626 4.1667 5.1011 5.2746 4.4304 5.6867 5.8166 2.8893 3.5247 4.1811 3.9916 1.4741 1.5349 5.8632 5.4569 3.0480 3.1402 3.0612 1.2872 1.2720 1.2478 1.7734 2.4819 1.2277 1.4115 1.8889 1.3155 1.3831 2.6070 2.3426 5.3499 3.2458 1.2431 1.2410 1.4746 1.3609 1.1081 1.5142 1.0566 1.0523 9.8061 7.6966 12.5237 1.0309 1.0309 1.0806 1.0620 1.1038 1.1040 1.1069 1.1030 1.1028 1.0936 1.0939
irintensity: 1.9024 3.5423 7.6151 4.6790 0.3296 4.4269 0.6772 4.5673 7.8083 4.4835 4.6348 2.0596 0.7163 6.5210 4.5175 7.1930 5.3004 1.7588 10.7456 19.1222 0.9817 5.5139 1.3950 6.1059 6.1196 1.4640 3.9887 29.3648 24.4564 62.0329 25.2925 3.7589 39.3569 10.4346 25.0790 7.7547 29.7385 24.5279 4.4951 10.2290 17.9743 7.0322 3.8907 59.7862 45.6168 104.5880 7.2652 1.7362 23.9733 17.4075 43.0521 20.9484 38.9043 5.3379 21.4903 2.5515 4.0563 17.6002 90.9114 51.0998 6.4427 42.3706 29.4271 20.8099 13.0137 19.9057 24.7444 3.4470 0.8131
temp: 298.150 k
press: 1.00000 atm
elementType: 8 8 7 6 6 6 6 6 6 6 6 6 6 6 1 1 1 1 1 1 1 1 1 1 1
symmnumber: 1
zpe: 505149.4 jmol-1
zpe.correction: 0.192401 hartree
zpe.thermalcorrener: 0.206016 hartree
zpe.thermalcorrenthalpy: 0.206960 hartree
zpe.thermalcorrgfe: 0.151972 hartree
zpe.sumelectzpe: -629.862248 hartree
zpe.sumelectthermal: -629.848634 hartree
zpe.sumelectthermalent: -629.847689 hartree
zpe.sumelectthermalfe: -629.902677 hartree
dipole: -3.3986 -2.4439 1.5557
dipole: 4.4657
quadrupole: -89.5412 -78.5086 -82.6590
quadrupole: -13.0140 6.9763 -1.6541
quadrupole: -5.9716 5.0610 0.9106 -13.0140 6.9763 -1.6541
hfenergy: -630.0546491 hartree
pointgroup: C01 [X(C11H11N1O2)]
dipole: -1.3970371 -0.9392122 0.503069 debye
dipolederiv: -1.0387729 0.5271801 -0.1392445 0.467905 -0.7951109 0.137464 -0.0705755 0.0915945 -0.3800601 -1.4896725 -0.2079053 0.0828169 -0.0627403 -0.4060499 0.0329896 -0.0600285 0.0151023 -0.3569695 -0.3547841 -0.0408182 -0.0202721 -0.1440189 -0.2554589 -0.0201603 0.0979618 0.0267318 -0.2133035 0.1552042 -0.0408182 0.0668551 -0.0811444 0.0598425 -0.0403282 -0.0439503 -0.0599621 0.2295725 0.0286911 -0.0291296 -0.0156403 0.0181056 0.1324108 -0.0445807 0.0662934 -0.0395567 0.1112764 0.1822089 -0.0988795 -0.0186656 0.1524211 -0.1049567 0.0601042 0.1928858 0.0356391 -0.0747125 0.0751231 -0.0160538 0.0332887 -0.2394627 -0.0230951 0.0141213 -0.0815399 0.0496303 -0.0615785 -0.1462443 0.1164769 0.0209881 -0.0600971 -0.0231782 0.0754838 -0.1042532 0.1073426 -0.0644266 -0.2214135 -0.0284323 0.0366812 0.1053207 0.0028628 0.0904449 0.1155184 0.0759236 -0.0555969 0.5433537 -0.4471603 0.0705837 -0.683872 0.5453419 -0.0486038 -0.2566793 0.1338294 -0.0589505 1.0548546 0.150076 0.0394967 0.3794894 0.0867583 0.0422443 0.4420602 0.0279342 -0.0091478 0.07209 0.146187 -0.0562029 0.2565516 0.0453977 -0.0367773 -0.1407062 -0.0868268 -0.041671 0.4432523 -0.198457 0.0889437 -0.1064381 0.3875229 -0.1456045 0.277848 -0.3462635 0.3865849 0.6642884 0.1201367 -0.1327479 -0.0309514 0.2547294 -0.0763946 -0.3882594 -0.1524845 0.3309175 -0.0449349 -0.0217159 -0.0566623 -0.0086543 0.0738411 0.0292115 -0.0614855 0.0285433 -0.0381999 -0.0113708 0.0520582 -0.0206185 0.0504584 -0.1010386 0.0737744 -0.088043 0.105577 0.0460534 -0.0351394 0.0536704 0.0753374 0.0082705 0.0890029 -0.0070818 0.1056896 -0.0390891 -0.0431337 0.1007842 -0.0213521 -0.0167246 -0.0150867 0.0102167 -0.0721637 -0.0078268 -0.06874 0.1281921 0.0866058 -0.0260131 -0.0306119 -0.0315523 0.0013891 -0.0744837 -0.0373799 -0.0769222 0.1221867 -0.0351968 -0.1155006 0.0945295 -0.0273386 -0.0068422 0.087894 -0.0231705 0.146173 -0.0199693 -0.036466 0.1441589 0.0282474 0.1444377 -0.0180328 -0.0111973 0.0449127 -0.0346401 0.0572868 0.0430965 -0.0256681 -0.0579341 -0.0956551 0.0330853 -0.094875 -0.0887446 -0.008318 -0.013203 -0.1470912 -0.0576612 -0.0539408 -0.0552566 0.106297 -0.0031672 -0.0852385 -0.0145974 0.0406931 0.0875624 -0.0018852 0.0093324 0.0780003 -0.0196273 -0.1000724 0.0803017 -0.0514305 0.0072403 0.0239712 0.0675062 -0.027835 -0.0186916 -0.0753077 0.1317584 0.1144098 0.1348098 -0.0290808 unknown
polarizability: 179.752164|-1.4105759|124.5381878|3.093112|7.2053993|80.9178473 unknown
InChI: InChI=1S/C11H11NO2/c1-13-10-4-7-3-8(6-12)9(7)5-11(10)14-2/h4-5,8H,3H2,1-2H3
charge 0 multiplicity 1
25 atoms
O  -2.117321 1.615843 0.58573
O  -2.742471 -0.881348 -0.727532
N  4.469213 1.229828 -0.404754
C  2.664391 -0.388313 0.692803
C  2.329358 -1.7369 -0.126194
C  1.169849 -0.031734 0.509816
C  0.877372 -1.239663 -0.160897
C  0.207603 0.950109 0.77035
C  -0.421869 -1.561261 -0.574474
C  -1.110358 0.654078 0.333002
C  -1.425513 -0.594695 -0.298566
C  3.66153 0.50503 0.09358
C  -2.713088 2.220315 -0.631198
C  -3.744324 -0.992006 0.360409
H  2.946372 -0.59622 1.741509
H  2.526805 -2.661012 0.443241
H  2.836925 -1.793354 -1.10347
H  0.407733 1.908185 1.258246
H  -0.70311 -2.489865 -1.079498
H  -1.938596 2.770265 -1.198193
H  -3.477682 2.921246 -0.263595
H  -3.170513 1.445189 -1.271721
H  -4.702819 -1.182098 -0.145725
H  -3.7925 -0.058935 0.949367
H  -3.491585 -1.842979 1.020867
