program: Gaussian 09
title: 000290537
version: EM64L-G09RevD.01
frameworkgroup: C1[X(C18H10Cl4N2)]
method: RPBEPBE
basis: SDD
operation: Freq
keyword: #p
keyword: freq=noraman
keyword: PBEPBE/SDD
title: #p freq=noraman PBEPBE/SDD
converged: YES YES NO NO
title: Mulliken charges:
elementType: Cl Cl Cl Cl N N C C C C C C C C C C C C C C C C C C H H H H H H H H H H
charge: 0.013175 0.009406 -0.046261 -0.039607 0.056308 0.055380 0.349794 0.458275 -0.354961 -0.354465 -0.408888 -0.405808 0.513446 -0.016076 -0.203321 -0.203455 -0.282935 -0.310849 -0.106395 -0.361569 -0.384987 -0.216758 -0.219499 -0.111637 0.257626 0.257268 0.259970 0.259866 0.273037 0.260731 0.238716 0.244319 0.259446 0.260709
chargesum: 0.00000
title: Mulliken charges with hydrogens summed into heavy atoms:
elementType: Cl Cl Cl Cl N N C C C C C C C C C C C C C C C C C C
charge: 0.013175 0.009406 -0.046261 -0.039607 0.056308 0.055380 0.349794 0.458275 -0.097335 -0.097197 -0.408888 -0.405808 0.513446 -0.016076 0.056649 0.056411 -0.009898 -0.050118 -0.106395 -0.122853 -0.140668 0.042688 0.041210 -0.111637
polarizability: 6.43634697e+02 9.52868719e+00 2.20631919e+02 1.04821560e+00 8.83740286e+00 1.18142937e+02
1716.lowfreq: -2.0191 -1.3855 -0.0023 -0.0017 -0.0015 3.6889 13.7231 26.1622 28.2994
frequency: 13.7215 26.1593 28.2375 41.7128 49.5013 51.7060 86.6422 110.9779 122.2789 149.3370 168.4323 171.9290 175.6960 197.0731 233.5906 268.0703 272.7104 277.9165 315.2247 345.4983 365.5136 374.8479 406.8035 409.2391 414.9962 422.2272 452.4788 493.1124 500.3413 509.4397 572.9426 580.6845 621.3016 626.3635 630.4614 674.5721 690.9848 715.7650 723.4316 736.8318 759.8919 781.0806 825.5751 828.6057 830.2651 833.3315 838.7167 902.6951 906.8459 953.9595 956.9094 964.0037 967.9400 969.0376 998.0523 1003.3409 1010.2975 1073.7862 1074.3680 1109.3420 1110.9685 1140.6553 1170.2970 1189.2666 1190.5071 1218.5915 1273.2930 1282.7988 1293.5121 1299.0994 1311.5876 1328.6790 1355.8933 1371.9629 1388.7999 1403.4541 1405.3336 1418.0353 1480.0793 1483.2100 1530.2158 1571.0538 1576.3546 1597.3366 1599.2229 1641.1284 3112.9416 3136.9643 3148.9498 3150.8340 3152.3548 3158.5851 3173.5349 3174.3823 3176.7699 3177.9213
redmass: 16.1047 14.8331 3.9436 11.5577 4.2965 14.2185 9.3088 9.4598 10.7057 9.5189 13.1726 4.6931 16.0235 10.1383 4.3244 17.6255 6.7596 5.6623 6.6018 4.2060 16.9081 9.2654 2.9446 2.8670 9.9755 6.2769 5.9788 7.0614 3.3151 3.5271 12.2943 5.1733 7.1839 7.0604 8.1811 6.0286 7.0761 3.8695 3.8347 7.4585 9.8296 6.1363 1.2665 1.2639 1.6196 1.6510 4.3516 1.9452 5.9311 1.3499 1.3478 5.0636 1.5246 1.3766 4.0312 3.9593 1.1808 2.7937 2.8721 1.4222 1.3900 5.8091 3.5816 1.1219 1.1678 2.0276 3.4731 1.9787 1.4703 1.6019 1.4250 4.9511 5.2233 4.4015 4.7006 4.4894 5.3769 4.3252 2.6203 2.7677 10.2050 7.0681 7.6159 6.0374 6.2950 5.8889 1.0904 1.0903 1.0888 1.0894 1.0892 1.0899 1.0958 1.0964 1.0966 1.0976
irintensity: 0.0025 0.0276 0.0011 0.1768 0.0905 0.0935 0.2604 1.3345 0.5202 0.6063 0.5705 0.0107 0.6611 0.1843 0.2464 3.3844 0.0782 0.1785 1.1586 0.1938 58.9723 6.2542 1.0579 0.0062 2.3412 0.9955 0.3295 5.4284 11.5962 27.9990 0.1029 16.4263 0.0712 0.1383 6.2978 1.6980 50.4682 2.1332 0.7182 1.8447 125.1171 5.9096 0.0599 2.4860 15.0777 83.1957 5.6740 2.3663 39.1486 2.1538 2.9622 0.5527 0.1241 0.0974 73.8544 84.1919 47.6205 85.5718 79.8333 6.0677 5.5479 157.8289 47.0763 6.3167 11.4241 32.9415 3.0329 95.4770 8.1910 20.5575 34.0905 137.4755 6.7010 32.3146 78.3467 72.8102 157.9379 444.4411 24.0942 211.7130 722.7041 4.4664 1.2022 52.5827 48.9463 218.7783 1.7845 5.3890 6.3361 2.6506 4.8756 12.4036 5.7203 4.3663 4.5033 0.5226
temp: 298.150 k
press: 1.00000 atm
elementType: 17 17 17 17 7 7 6 6 6 6 6 6 6 6 6 6 6 6 6 6 6 6 6 6 1 1 1 1 1 1 1 1 1 1
symmnumber: 1
zpe: 597004.6 jmol-1
zpe.correction: 0.227387 hartree
zpe.thermalcorrener: 0.248680 hartree
zpe.thermalcorrenthalpy: 0.249624 hartree
zpe.thermalcorrgfe: 0.172843 hartree
zpe.sumelectzpe: -2640.006620 hartree
zpe.sumelectthermal: -2639.985326 hartree
zpe.sumelectthermalent: -2639.984382 hartree
zpe.sumelectthermalfe: -2640.061163 hartree
dipole: -1.3264 -0.4123 0.0215
dipole: 1.3892
quadrupole: -180.6468 -164.5277 -163.2149
quadrupole: 0.8899 0.5111 4.7432
quadrupole: -11.1836 4.9354 6.2482 0.8899 0.5111 4.7432
hfenergy: -2640.2340067 hartree
pointgroup: C01 [X(C18H10Cl4N2)]
dipole: -0.5222215 0.1593693 0.0247343 debye
polarizability: 643.6572592|-7.8886832|213.4035982|-4.5948159|27.6320728|125.3486953 unknown
InChI: InChI=1S/C18H10Cl4N2/c19-13-6-1-11(2-7-13)3-10-15-23-17(21)16(18(22)24-15)12-4-8-14(20)9-5-12/h1-10H
charge 0 multiplicity 1
34 atoms
Cl 2.586055 -2.937635 -0.382877
Cl 1.931015 2.609553 0.306998
Cl 8.33045 0.560513 0.055817
Cl -8.983057 0.078859 0.043789
N  0.262727 -1.601238 -0.239198
N  -0.016708 0.773403 0.103637
C  3.725986 0.007388 -0.012465
C  2.24926 -0.166673 -0.035524
C  4.51218 -0.350429 -1.138729
C  4.372003 0.535032 1.13606
C  1.58784 -1.4207 -0.211813
C  1.310084 0.903039 0.115623
C  -4.338363 0.225641 0.039393
C  -0.53421 -0.490445 -0.07675
C  5.912706 -0.181731 -1.126833
C  5.772539 0.701275 1.166522
C  -2.877342 0.332595 0.047753
C  -1.976609 -0.692226 -0.100402
C  6.522237 0.341653 0.029854
C  -5.033463 -1.00913 -0.132074
C  -5.110403 1.411833 0.211708
C  -6.439115 -1.058535 -0.131436
C  -6.519202 1.379964 0.215016
C  -7.165049 0.140078 0.042727
H  4.031157 -0.757274 -2.033666
H  3.782436 0.814095 2.015003
H  6.514836 -0.451042 -1.998966
H  6.26793 1.10142 2.055441
H  -2.45745 1.338416 0.187904
H  -2.281406 -1.733436 -0.245836
H  -4.475626 -1.941305 -0.267375
H  -4.596865 2.371087 0.345095
H  -6.966684 -2.007481 -0.263345
H  -7.101986 2.295439 0.348252
