program: Gaussian 09
title: 000290526
version: EM64L-G09RevD.01
frameworkgroup: C1[X(C22H20ClN3O4S)]
method: RPBEPBE
basis: SDD
operation: Freq
keyword: #p
keyword: freq=noraman
keyword: PBEPBE/SDD
title: #p freq=noraman PBEPBE/SDD
converged: YES YES NO NO
title: Mulliken charges:
elementType: Cl S O O O O N N N C C C C C C C C C C C C C C C C C C C C C C H H H H H H H H H H H H H H H H H H H H
charge: -0.046330 0.931771 -0.270276 -0.322359 -0.547131 -0.561520 -0.482721 -0.040166 -0.479529 0.218961 0.288827 0.243164 -0.233021 -0.060063 0.276661 -0.379700 0.270723 -0.375109 0.163090 -0.287266 -0.273548 0.287626 -0.237755 -0.383332 -0.386195 -0.248930 -0.364438 -0.115958 -0.757624 -0.494277 -0.531978 0.350418 0.275912 0.243718 0.283832 0.274334 0.238103 0.258972 0.278708 0.258592 0.233577 0.258383 0.264677 0.283869 0.275142 0.248480 0.224347 0.222278 0.256677 0.225575 0.242809
chargesum: 0.00000
title: Mulliken charges with hydrogens summed into heavy atoms:
elementType: Cl S O O O O N N N C C C C C C C C C C C C C C C C C C C C C C
charge: -0.046330 0.931771 -0.270276 -0.322359 -0.547131 -0.561520 -0.132303 -0.040166 -0.221146 0.218961 0.288827 0.243164 -0.233021 -0.060063 0.276661 -0.103788 0.270723 -0.131391 0.163090 -0.003434 0.000785 0.287626 0.000348 -0.124360 -0.107486 0.009662 -0.130862 -0.115958 0.066064 0.200827 0.193082
polarizability: 7.75038142e+02 3.96580517e+01 3.98140370e+02 8.25988999e+00 7.89844711e-01 1.92687935e+02
1716.lowfreq: 0.0004 0.0011 0.0012 1.2545 1.6204 4.0440 14.3061 17.1119 26.7241
frequency: 14.2406 17.0804 26.6755 32.2631 38.5614 44.8585 49.9061 71.9114 84.7451 92.8282 105.8354 110.2442 117.9200 128.4965 137.3216 158.2834 163.3698 174.0293 185.5367 199.5595 217.9282 221.5974 232.0689 242.1320 255.4402 265.5658 282.7229 289.9771 306.3334 311.0043 332.3548 342.7197 366.9964 387.5000 392.1960 404.6854 425.6785 446.4935 453.2781 462.5552 482.7111 522.1040 527.5462 540.0922 547.9705 555.9987 571.6855 573.9585 599.5869 608.6555 620.1666 628.5186 655.4430 686.9221 698.6536 708.5124 717.2681 738.4497 764.5083 785.0019 790.7743 797.3361 804.4086 812.0134 834.8198 842.1933 856.8599 862.4359 885.9179 890.3675 892.1369 907.7336 926.5241 934.5077 937.7914 958.1255 965.5285 975.3867 998.0287 1001.8577 1019.3955 1057.9790 1076.3791 1098.8224 1108.3363 1120.4704 1128.4741 1144.8051 1156.2321 1176.0906 1179.3836 1184.1775 1186.5242 1229.1671 1232.9711 1246.1688 1255.1751 1289.3824 1296.3478 1302.1099 1317.0688 1326.0625 1358.7502 1378.0042 1393.9897 1414.1186 1414.3379 1419.2289 1425.7808 1430.0414 1438.5734 1447.4300 1452.3089 1457.8928 1460.3664 1467.8950 1468.8409 1473.3828 1482.9533 1514.7369 1521.1966 1541.6466 1558.9676 1569.7549 1593.6869 1607.4542 1613.2891 2976.1048 2999.4011 3035.2876 3072.0365 3108.2705 3130.8857 3135.1359 3135.5591 3143.0999 3145.2790 3170.0398 3175.3183 3175.5111 3179.7443 3181.3032 3182.2825 3193.9304 3197.7580 3304.7425 3474.7491
redmass: 7.8199 8.7449 3.9014 5.3932 5.3881 6.5170 4.6163 6.4974 4.5351 4.8487 4.9456 5.7103 5.9868 3.8733 4.6134 1.2562 4.5406 2.6420 1.6585 3.0771 3.4252 1.9429 4.8488 4.1662 3.6729 3.5212 4.1822 4.0749 7.5761 7.2273 4.7053 5.8644 7.8527 4.3740 5.4432 4.5811 3.9827 5.7227 3.4245 4.4930 6.2327 4.1455 6.6497 6.1361 4.3448 5.3352 4.0379 7.2862 2.6619 3.2859 4.8061 4.5370 2.7773 6.2871 6.1518 5.5605 3.6760 3.0510 1.7959 11.2221 1.7963 2.7535 1.8426 3.9727 3.8541 1.7941 2.5557 5.8895 1.5470 1.5228 1.4206 6.3022 2.3962 1.7948 7.1915 1.3296 1.2950 1.3245 2.5003 2.1083 4.7519 2.0894 2.0035 2.7674 1.2487 1.2860 1.9333 1.3845 1.3695 1.3296 1.2619 1.5616 1.7230 2.0308 1.9584 2.9960 2.1633 2.8640 2.5056 1.2129 2.2443 2.8633 2.9762 3.5358 3.5740 1.8889 1.3624 1.0589 2.2566 3.8543 1.4131 1.1782 1.4277 1.1393 2.2914 1.1162 2.3654 1.8047 1.4051 4.1951 7.9649 6.7283 7.0187 3.6429 5.9690 6.4949 6.9248 1.0320 1.0293 1.0248 1.1048 1.1037 1.1052 1.1007 1.0907 1.0881 1.0874 1.0921 1.0961 1.0948 1.1070 1.0934 1.0973 1.1071 1.0918 1.0743 1.0745
irintensity: 1.6446 1.8933 2.2197 4.2967 1.2903 1.2612 9.1100 4.2655 1.0539 28.2122 36.1611 8.3937 15.1538 4.6313 8.7062 8.8994 4.9046 7.0032 17.3672 28.1480 1.7017 25.4682 0.2498 6.2338 5.7589 15.0012 0.3326 10.4690 34.4038 2.3945 7.6794 0.2890 40.9088 43.6856 6.4359 26.0749 12.4097 8.7173 4.8282 5.7156 10.7180 6.5763 24.5622 19.9395 8.1675 22.2191 29.9661 99.3903 74.8367 30.4534 20.8473 12.1345 35.1590 16.5316 36.3810 2.1402 12.4972 14.2708 56.9295 81.8116 31.2880 6.8683 21.1864 27.4053 21.7079 33.2707 69.7499 3.1946 38.1179 15.8502 11.1870 98.3430 5.2018 2.0746 6.2419 1.5389 59.1149 2.3939 19.7614 78.9448 66.8654 30.7441 17.4829 56.6695 4.0076 4.0557 73.9935 2.9917 1.8832 4.8526 13.7386 53.0276 19.2183 16.5683 21.0622 187.1894 115.2002 12.9696 65.6273 1.0964 19.3481 75.7635 306.8495 36.8224 153.8694 53.6391 44.9099 8.6183 202.4579 71.6745 3.6602 72.6537 77.2185 19.7942 25.4178 20.7409 4.8435 110.6195 71.3402 410.6208 260.7777 5.5928 7.8817 60.9489 29.3902 533.1468 69.2560 48.3836 68.6651 2.1460 25.4833 56.3679 24.5778 20.2345 1.4201 3.6449 6.4108 8.4865 4.8701 7.0595 1.5672 1.8311 8.2278 0.9777 1.2864 9.3130 71.2122
temp: 298.150 k
press: 1.00000 atm
elementType: 17 16 8 8 8 8 7 7 7 6 6 6 6 6 6 6 6 6 6 6 6 6 6 6 6 6 6 6 6 6 6 1 1 1 1 1 1 1 1 1 1 1 1 1 1 1 1 1 1 1 1
symmnumber: 1
zpe: 987840.2 jmol-1
zpe.correction: 0.376248 hartree
zpe.thermalcorrener: 0.406515 hartree
zpe.thermalcorrenthalpy: 0.407460 hartree
zpe.thermalcorrgfe: 0.311882 hartree
zpe.sumelectzpe: -2171.222434 hartree
zpe.sumelectthermal: -2171.192168 hartree
zpe.sumelectthermalent: -2171.191223 hartree
zpe.sumelectthermalfe: -2171.286801 hartree
dipole: 0.2128 -4.1621 -2.1395
dipole: 4.6846
quadrupole: -206.3717 -188.7430 -192.1505
quadrupole: -28.9646 -9.9346 -11.9755
quadrupole: -10.6167 7.0121 3.6046 -28.9646 -9.9346 -11.9755
hfenergy: -2171.5986829 hartree
pointgroup: C01 [X(C22H20Cl1N3O4S1)]
dipole: -0.4007776 -1.798879 -0.0173859 debye
polarizability: 744.4904443|-114.7867918|383.2819758|49.3579997|72.5514903|238.0940266 unknown
InChI: InChI=1S/C21H17ClN3O2.CH3O2S/c1-26-18-5-3-4-15-20(24-16-9-7-13(23)11-19(16)27-2)14-8-6-12(22)10-17(14)25-21(15)18;1-4(2)3/h3-11,23-24H,1-2H3;1H3
charge 0 multiplicity 1
51 atoms
Cl 5.89083 -4.141449 -0.525917
S  -6.30324 1.493584 -0.345375
O  4.420595 3.108652 1.988028
O  -1.785444 -0.974196 -2.715123
O  -6.542483 2.939371 0.401874
O  -5.726483 1.465907 -1.884992
N  0.149001 -0.367682 -1.057932
N  3.959264 0.503208 0.713072
N  -5.211421 -0.12101 0.690831
C  1.385131 -0.054911 -0.439748
C  1.653442 1.241755 0.113899
C  2.411753 -1.049713 -0.450755
C  2.969115 1.447482 0.734518
C  3.706858 -0.700063 0.116259
C  -1.144137 -0.246572 -0.544145
C  0.734846 2.336824 0.011948
C  3.244784 2.744763 1.341563
C  2.223875 -2.37788 -0.971137
C  -2.22098 -0.593812 -1.433864
C  4.775025 -1.664502 0.079165
C  -1.460485 0.146487 0.786485
C  -3.864898 -0.133106 0.320223
C  1.066262 3.576522 0.558257
C  2.300819 3.775722 1.238843
C  -3.550061 -0.554995 -1.013357
C  3.26749 -3.299388 -0.990315
C  -2.796077 0.237902 1.199065
C  4.544971 -2.914525 -0.471137
C  -7.997181 0.613268 -0.393315
C  5.378631 2.137947 2.551444
C  -2.816798 -1.240698 -3.727152
H  0.181333 -0.829389 -1.97386
H  -0.214872 2.205532 -0.510842
H  1.238856 -2.686497 -1.336427
H  5.743031 -1.375715 0.49532
H  -0.654187 0.395371 1.48071
H  0.368162 4.415308 0.468472
H  2.548959 4.743144 1.685007
H  -4.376107 -0.810182 -1.679182
H  3.121572 -4.310196 -1.38115
H  -3.028745 0.577045 2.215491
H  -5.323426 0.201478 1.677505
H  -8.366195 0.572487 0.640458
H  -8.636348 1.232441 -1.038237
H  -7.809313 -0.38453 -0.808777
H  5.967261 1.659388 1.755577
H  4.859183 1.355895 3.131321
H  6.014954 2.750752 3.210088
H  -3.480781 -0.364603 -3.843371
H  -3.412978 -2.132026 -3.454837
H  -2.266166 -1.428002 -4.660174
