program: Gaussian 09
title: 000290521
version: EM64L-G09RevD.01
frameworkgroup: C1[X(C20H13N)]
method: RPBEPBE
basis: SDD
operation: Freq
keyword: #pfreq=noraman
keyword: PBEPBE/SDD
title: #p freq=noraman PBEPBE/SDD
converged: YES YES NO NO
title: Mulliken charges:
elementType: N C C C C C C C C C C C C C C C C C C C C H H H H H H H H H H H H H
charge: -0.029618 0.139977 0.159085 0.082037 0.517202 0.206628 0.461372 0.446449 -0.080779 -0.043216 -0.821242 -0.494530 -0.483450 -0.348981 -0.472659 -0.340254 -0.476687 -0.828951 -0.228344 -0.285066 -0.247502 0.249153 0.243413 0.239685 0.255704 0.241871 0.262539 0.248159 0.230707 0.274387 0.230413 0.230311 0.228812 0.233374
chargesum: 0.00000
title: Mulliken charges with hydrogens summed into heavy atoms:
elementType: N C C C C C C C C C C C C C C C C C C C C
charge: -0.029618 0.139977 0.159085 0.082037 0.517202 0.206628 0.461372 0.446449 -0.080779 -0.043216 -0.572088 -0.251117 -0.243764 -0.093278 -0.230788 -0.077715 -0.228528 -0.093444 0.001967 -0.056254 -0.014128
polarizability: 4.32667344e+02 5.91245058e+00 2.49033694e+02 -2.52292329e-02 -8.17623991e-02 8.69225747e+01
1716.lowfreq: -0.0004 0.0004 0.0004 6.9769 8.6859 11.3222 17.3101 72.0759 107.8398
frequency: 12.4328 72.0746 107.8397 161.0067 195.3536 220.4198 273.6564 297.8438 314.6078 321.1347 330.2374 351.7001 373.8048 413.3752 435.7685 460.7689 485.1805 497.7780 515.6728 526.2912 528.9546 569.6778 573.0160 597.3376 599.2910 637.0430 662.6349 711.4486 718.5425 750.1791 759.4040 768.6605 774.2922 801.6918 843.1666 848.3367 853.5227 859.0636 876.0016 917.2250 938.5482 942.0130 967.5616 984.2050 991.3175 994.1967 995.9172 1016.0065 1042.6056 1045.2682 1054.9530 1070.6324 1125.4935 1154.1708 1175.9826 1181.8514 1199.5284 1212.9513 1248.0864 1255.8360 1274.4622 1295.1732 1321.2383 1335.8312 1366.5523 1386.4846 1392.6315 1402.6770 1411.9934 1427.5123 1439.0348 1446.5708 1468.5537 1480.3365 1488.9560 1490.3489 1506.7346 1555.5313 1572.9108 1579.3037 1610.1955 1622.7780 1635.2705 2978.7288 3063.5030 3113.9434 3117.7733 3121.4236 3123.7527 3127.1993 3136.5506 3146.1194 3148.0682 3160.9551 3171.2417 3255.0444
redmass: 3.5246 4.0535 4.1247 4.8870 4.1684 5.0917 4.3682 4.2582 4.4256 2.8505 4.0737 1.4171 5.3492 2.9102 6.0957 5.0064 2.9876 6.8834 3.4684 4.1390 6.0715 5.2933 3.5125 3.3409 6.0725 6.0226 6.2903 3.2903 3.5567 5.7679 1.2934 6.0237 1.5577 1.9570 1.6849 4.8305 5.5494 2.4596 1.9444 1.4574 6.7113 1.8058 1.4460 1.3787 1.3688 1.4113 3.9575 2.0548 2.7352 1.6088 2.9048 1.8415 1.9145 1.4405 1.2224 1.1777 1.4885 2.0643 1.9314 1.9588 2.4070 2.5254 2.5652 4.4151 5.6144 1.3752 3.6384 3.6279 2.6443 2.9194 2.6064 3.8249 2.0626 3.5566 1.0508 2.0513 3.7204 6.0543 7.8177 6.0042 6.2270 6.8823 6.9952 1.0384 1.0985 1.0967 1.0911 1.0864 1.0871 1.0874 1.0910 1.0979 1.0931 1.0994 1.0975 1.0893
irintensity: 0.0777 0.0086 2.9340 0.4492 3.7271 2.2424 0.0987 0.7752 0.6407 0.0163 1.2397 2.0547 0.0689 0.2196 0.5362 3.1486 7.7218 0.0888 0.6091 2.0684 2.5860 0.2397 1.3153 14.0701 0.6245 3.5096 3.5269 0.5016 9.9300 0.4747 52.1967 3.6573 53.1016 0.1862 16.2780 1.0847 0.3278 12.5967 32.2744 0.1818 1.6666 30.9587 12.0271 5.5829 0.3118 1.5878 1.9005 3.0277 5.8562 1.7473 4.7266 4.2221 0.3329 0.8354 10.2246 0.4614 13.5891 4.3362 14.3049 2.1183 0.8785 2.2887 3.0102 8.9808 3.9273 15.7086 21.3447 2.1653 6.0170 4.1507 3.0728 20.5109 14.2893 2.1167 16.6488 5.7935 9.1489 16.3413 3.9694 8.7048 3.8208 0.1582 4.1211 17.9073 15.1517 11.7851 3.4396 0.6100 6.0692 5.5855 17.1010 22.6211 39.8258 43.8866 21.8611 9.7869
temp: 298.150 k
press: 1.00000 atm
elementType: 7 6 6 6 6 6 6 6 6 6 6 6 6 6 6 6 6 6 6 6 6 1 1 1 1 1 1 1 1 1 1 1 1 1
symmnumber: 1
zpe: 698553.0 jmol-1
zpe.correction: 0.266065 hartree
zpe.thermalcorrener: 0.280399 hartree
zpe.thermalcorrenthalpy: 0.281343 hartree
zpe.thermalcorrgfe: 0.224346 hartree
zpe.sumelectzpe: -823.349115 hartree
zpe.sumelectthermal: -823.334781 hartree
zpe.sumelectthermalent: -823.333837 hartree
zpe.sumelectthermalfe: -823.390834 hartree
dipole: -1.1975 -1.8893 -0.0017
dipole: 2.2369
quadrupole: -100.1336 -109.5250 -128.3215
quadrupole: -4.7471 0.0011 -0.0204
quadrupole: 12.5265 3.1350 -15.6615 -4.7471 0.0011 -0.0204
hfenergy: -823.61518 hartree
pointgroup: C01 [X(C20H13N1)]
dipole: 0.4793188 0.7380612 -0.0020022 debye
polarizability: 432.7754147|3.8779432|248.925268|-0.3393504|-0.1065638|86.9229302 unknown
InChI: InChI=1S/C20H13N/c1-12-18-16-7-3-2-5-14(16)11-15-10-9-13-6-4-8-17(21-12)19(13)20(15)18/h2-11H,1H3
charge 0 multiplicity 1
34 atoms
N  -1.256832 -2.328972 0.004869
C  -0.350164 0.366647 0.000248
C  0.618603 -0.706099 0.000252
C  -1.75857 0.079411 0.001359
C  0.05641 1.762975 -0.000802
C  2.041558 -0.354915 -0.002631
C  -2.748674 1.12805 0.000796
C  2.416439 1.054646 -0.002728
C  -2.179737 -1.290118 0.002956
C  0.064738 -2.073454 0.003908
C  1.41995 2.07172 -0.001569
C  -0.954243 2.805331 -0.000934
C  -2.299674 2.50645 -0.000318
C  3.130724 -1.293569 -0.006206
C  -4.122028 0.779307 0.001337
C  -3.567236 -1.608625 0.003478
C  3.798872 1.442865 -0.004693
C  0.885834 -3.353412 0.008433
C  -4.525347 -0.578672 0.00255
C  4.469842 -0.888537 -0.008462
C  4.818031 0.494062 -0.007326
H  1.738147 3.121814 -0.001807
H  -0.614084 3.847474 -0.001707
H  -3.051598 3.303934 -0.00064
H  2.935963 -2.361143 -0.007848
H  -4.875756 1.575361 0.000814
H  -3.85166 -2.664993 0.004761
H  4.035676 2.513446 -0.004422
H  1.52894 -3.437803 0.903757
H  0.172112 -4.190694 0.015494
H  1.522478 -3.448192 -0.890532
H  -5.592197 -0.827178 0.002924
H  5.259305 -1.648246 -0.011333
H  5.869478 0.799932 -0.00888
