program: Gaussian 09
title: 000290520
version: EM64L-G09RevD.01
frameworkgroup: C1[X(C20H13N)]
method: RPBEPBE
basis: SDD
operation: Freq
keyword: #pfreq=noraman
keyword: PBEPBE/SDD
title: #p freq=noraman PBEPBE/SDD
converged: YES YES NO YES
title: Mulliken charges:
elementType: N C C C C C C C C C C C C C C C C C C C C H H H H H H H H H H H H H
charge: -0.019208 0.146955 0.117446 0.325830 -0.125216 0.227770 0.481501 0.161983 0.479482 -0.046200 -0.447523 -0.672799 -0.504386 -0.411798 -0.459779 -0.356443 -0.253089 -0.447994 -0.791549 -0.257977 -0.252490 0.226198 0.268823 0.237829 0.245944 0.245395 0.224780 0.227873 0.250797 0.228180 0.228171 0.262155 0.228531 0.230809
chargesum: 0.00000
title: Mulliken charges with hydrogens summed into heavy atoms:
elementType: N C C C C C C C C C C C C C C C C C C C C
charge: -0.019208 0.146955 0.117446 0.325830 -0.125216 0.227770 0.481501 0.161983 0.479482 -0.046200 -0.221325 -0.403976 -0.266556 -0.165854 -0.214384 -0.131663 -0.025216 -0.197197 -0.073044 -0.029446 -0.021681
polarizability: 4.34602835e+02 -1.58049576e+01 2.49010216e+02 2.82376416e-03 3.47503089e-04 8.71727311e+01
1716.lowfreq: -5.5678 -0.0006 -0.0003 0.0011 5.2940 10.1382 62.0880 74.4395 121.9864
frequency: 62.0800 74.4307 121.9787 166.0285 186.3559 195.0718 201.8036 234.3965 279.8728 303.6175 332.6210 344.2499 357.7084 413.8027 453.3336 465.3014 478.1181 499.3759 518.5764 527.5641 528.0031 565.1910 569.8059 592.8778 601.1394 616.7733 678.7158 707.0179 718.4148 722.3797 763.5872 773.1254 777.3590 780.7650 843.9524 850.6253 858.2705 875.8750 882.8828 916.4296 917.0950 934.2126 964.8806 977.2209 989.6329 992.7523 1007.2151 1013.7006 1036.2012 1040.6959 1062.3954 1087.7520 1129.3229 1147.4763 1169.3677 1176.9954 1194.1812 1213.3310 1238.7732 1257.4806 1288.3973 1314.8297 1324.6704 1334.9936 1384.6954 1397.2679 1399.1785 1416.2207 1417.1806 1430.3059 1439.4716 1447.1048 1453.3945 1467.9714 1474.5917 1487.2073 1520.6108 1552.5904 1571.4346 1594.2615 1600.9244 1623.1034 1627.0153 2977.6087 3053.1344 3121.4956 3124.6901 3125.6079 3127.8751 3134.7741 3144.1980 3150.0229 3152.4888 3160.2587 3163.8586 3167.1686
redmass: 5.0929 3.7674 3.6838 1.3560 4.3730 2.2863 4.7085 4.1351 3.0603 4.6728 6.9744 4.1343 5.4635 3.7260 5.4206 3.2541 7.4367 4.9462 3.1256 4.5625 5.4352 6.4603 3.3878 3.1496 6.4884 5.6569 5.6049 3.6022 6.8676 3.2842 1.3595 5.3372 1.7941 1.5911 4.6638 2.3200 2.1021 1.6844 5.3745 5.2615 1.4347 1.9733 1.4354 1.3777 1.3970 1.3551 2.7296 2.7947 2.2703 1.6093 4.0968 2.0387 2.2270 1.7398 1.2902 1.1032 1.3361 1.6664 1.7361 1.8150 2.9945 2.3457 2.6616 3.4871 1.2872 5.2946 3.1341 4.8440 3.0381 4.3388 2.9558 2.5360 1.8170 1.0475 3.0390 2.9879 3.9038 5.2586 7.1529 7.2433 6.5446 7.5975 6.5993 1.0387 1.0969 1.0974 1.0855 1.0871 1.0875 1.0891 1.0917 1.0947 1.0922 1.0962 1.0977 1.0977
irintensity: 1.2378 0.3023 1.9677 0.8903 0.3826 0.3313 1.5063 1.7405 0.2902 0.0544 0.2689 0.7544 0.1688 0.0356 1.2123 8.7989 0.9338 2.3678 0.7957 10.9233 0.1237 3.1011 0.0360 0.6543 2.9941 6.2586 1.5335 0.1179 3.6389 3.9182 67.3733 0.3077 50.3763 6.0231 1.5516 0.0340 63.9342 1.1277 0.6274 1.3375 1.1672 24.6008 9.4244 0.9804 0.7071 1.1956 3.4200 1.4039 7.9206 1.2805 0.2108 7.4581 2.6395 1.5410 1.3679 2.3150 3.9034 5.9188 5.6398 8.1135 4.3604 37.9401 0.8818 12.3590 23.3204 5.1681 4.1952 0.6951 2.3805 7.2030 5.8239 0.0754 22.6219 17.2922 14.9490 0.3178 2.7473 32.4903 0.1622 12.9403 0.8741 0.2268 1.5080 25.4426 17.8217 9.4361 1.0528 2.1969 4.4634 9.1969 21.5501 10.2937 6.0488 26.1202 38.1437 45.3916
temp: 298.150 k
press: 1.00000 atm
elementType: 7 6 6 6 6 6 6 6 6 6 6 6 6 6 6 6 6 6 6 6 6 1 1 1 1 1 1 1 1 1 1 1 1 1
symmnumber: 1
zpe: 697188.2 jmol-1
zpe.correction: 0.265545 hartree
zpe.thermalcorrener: 0.280067 hartree
zpe.thermalcorrenthalpy: 0.281011 hartree
zpe.thermalcorrgfe: 0.224880 hartree
zpe.sumelectzpe: -823.358630 hartree
zpe.sumelectthermal: -823.344108 hartree
zpe.sumelectthermalent: -823.343164 hartree
zpe.sumelectthermalfe: -823.399295 hartree
dipole: 0.6929 -1.9579 0.0001
dipole: 2.0768
quadrupole: -95.8145 -110.3785 -128.2929
quadrupole: -0.0194 0.0004 0.0001
quadrupole: 15.6808 1.1168 -16.7976 -0.0194 0.0004 0.0001
hfenergy: -823.6241745 hartree
pointgroup: C01 [X(C20H13N1)]
dipole: -0.2964334 -0.7614274 -0.0000228 debye
polarizability: 435.4061651|10.0029569|248.2068852|0.0028116|-0.0004352|87.1727311 unknown
InChI: InChI=1S/C20H13N/c1-12-15-8-4-6-13-9-10-17-16-7-3-2-5-14(16)11-18(21-12)20(17)19(13)15/h2-11H,1H3
charge 0 multiplicity 1
34 atoms
N  -0.872009 2.411923 -0.000175
C  -0.163331 0.010695 -0.000169
C  -1.542421 -0.383815 -0.000177
C  0.884139 -0.96523 -0.000162
C  0.138011 1.429568 -0.000172
C  -2.570203 0.626275 -0.000186
C  -1.894542 -1.779981 -0.000181
C  2.268251 -0.519972 -0.000155
C  2.547614 0.905441 -0.000159
C  -2.152003 2.037249 -0.000178
C  0.502812 -2.357513 -0.000164
C  1.474141 1.848555 -0.000168
C  -0.829063 -2.749935 -0.000173
C  -3.927584 0.222083 -0.000207
C  -3.272455 -2.143175 -0.000197
C  3.380369 -1.422758 -0.000147
C  -4.271565 -1.15296 -0.000212
C  3.910668 1.356774 -0.000153
C  -3.189621 3.14042 -0.000202
C  4.698402 -0.955109 -0.000141
C  4.969454 0.448537 -0.000144
H  1.27746 -3.129721 -0.000161
H  1.681822 2.923559 -0.000171
H  -1.088888 -3.814995 -0.000175
H  -4.72241 0.974372 -0.000222
H  -3.546566 -3.204708 -0.000198
H  3.206511 -2.502983 -0.000143
H  -5.327416 -1.444851 -0.000227
H  4.103501 2.435869 -0.000153
H  -3.843104 3.081919 -0.89148
H  -3.843351 3.081753 0.89088
H  -2.674877 4.112499 -0.00005
H  5.530709 -1.667645 -0.000135
H  6.005644 0.803564 -0.00014
