program: Gaussian 09
title: 000290519
version: EM64L-G09RevD.01
frameworkgroup: C1[X(C19H11N)]
method: RPBEPBE
basis: SDD
operation: Freq
keyword: #pfreq=noraman
keyword: PBEPBE/SDD
title: #p freq=noraman PBEPBE/SDD
converged: YES YES NO YES
title: Mulliken charges:
elementType: N C C C C C C C C C C C C C C C C C C C H H H H H H H H H H H
charge: -0.003601 0.125326 0.088735 0.333320 0.164006 -0.093448 0.490966 0.381930 0.474598 -0.447594 -0.651859 -0.500416 -0.566701 -0.454843 -0.430785 -0.354870 -0.444479 -0.238874 -0.256675 -0.251696 0.226169 0.267656 0.238383 0.252575 0.245562 0.239196 0.225197 0.251066 0.230105 0.229373 0.231676
chargesum: 0.00000
title: Mulliken charges with hydrogens summed into heavy atoms:
elementType: N C C C C C C C C C C C C C C C C C C C
charge: -0.003601 0.125326 0.088735 0.333320 0.164006 -0.093448 0.490966 0.381930 0.474598 -0.221425 -0.384203 -0.262033 -0.314126 -0.209280 -0.191589 -0.129673 -0.193413 -0.008768 -0.027302 -0.020020
polarizability: 4.21006307e+02 -4.64561768e+00 2.28767452e+02 -3.42281430e-03 -1.45146927e-03 7.79515115e+01
1716.lowfreq: -7.0166 -0.0010 -0.0003 0.0007 7.7614 13.2828 63.1646 90.6997 158.0129
frequency: 63.1412 90.6942 158.0129 187.4751 210.4877 212.0713 289.8491 303.3184 331.3987 375.6235 400.1636 444.8925 462.1695 473.2025 503.6021 511.0106 524.0966 527.7887 547.0739 568.0298 570.0203 604.0114 634.7422 692.6492 694.1622 722.8306 747.2620 763.3908 776.7977 778.5945 811.1503 843.2502 849.1063 853.4765 876.0816 884.8289 908.4540 933.2328 950.1316 965.6809 979.0876 979.8159 990.9484 993.7671 1024.4956 1038.9710 1074.7581 1098.0044 1123.2529 1157.4139 1177.2736 1187.2744 1193.5548 1232.0382 1246.5653 1262.7777 1278.7526 1319.1565 1333.2367 1367.1276 1397.9736 1408.8322 1415.7935 1416.7437 1429.2039 1439.0159 1450.4453 1472.0566 1480.7344 1520.4030 1547.1179 1573.0996 1595.6548 1601.1959 1622.3186 1627.7157 3095.8396 3124.4817 3125.3000 3127.9930 3133.2581 3134.8862 3150.4495 3152.6984 3158.5802 3161.5875 3167.4990
redmass: 5.2990 4.0220 4.6286 4.5982 5.1222 4.5306 3.9374 4.6953 7.4939 5.3544 3.6699 5.6982 3.2131 7.7220 5.6416 3.5006 6.8681 4.5032 2.8386 6.1590 3.3158 7.0065 6.5229 6.2835 3.5302 3.3851 6.2279 1.3521 1.4720 1.9114 5.6686 4.9470 3.1085 1.5225 1.7067 5.6211 1.4542 1.9389 1.5336 1.4367 1.3971 6.5700 1.4078 1.3595 4.0750 2.6457 2.0133 2.9138 2.1069 1.3392 1.0975 1.3064 1.4007 1.6242 2.2060 1.8148 1.9451 2.4971 3.4800 1.8742 3.0180 3.1343 3.6199 5.0857 4.1002 3.0226 4.1758 4.0037 3.9228 3.9805 5.5072 7.2268 7.2701 6.4849 7.2984 6.6645 1.0909 1.0864 1.0855 1.0881 1.0916 1.0892 1.0945 1.0926 1.0987 1.0965 1.0973
irintensity: 1.4000 0.1107 0.4109 0.2330 1.4137 3.6858 0.1036 0.1360 0.2362 0.0388 0.2507 0.1632 6.7192 0.3492 2.2728 0.7025 2.4559 13.7335 2.7074 4.0934 0.3326 0.2028 3.6532 1.6572 0.0987 4.7699 4.3287 65.9430 1.6298 57.4633 7.8795 0.7595 9.7286 39.2895 0.3873 0.5962 10.0636 14.4142 21.3384 10.7515 3.1787 0.0942 2.1314 1.9465 2.4342 6.0089 4.4005 4.4005 4.1327 1.7441 2.6135 8.2704 2.2210 4.3589 6.9555 20.8986 0.3026 1.9629 0.9997 2.4180 0.6272 0.6314 3.8940 1.0709 3.7100 0.2580 7.6979 12.3817 5.0033 2.2544 12.7489 0.8370 9.4220 4.0946 0.4262 0.2401 24.4915 0.7553 0.9181 2.0836 13.9291 11.6407 11.1949 7.4034 37.7881 33.0958 44.9165
temp: 298.150 k
press: 1.00000 atm
elementType: 7 6 6 6 6 6 6 6 6 6 6 6 6 6 6 6 6 6 6 6 1 1 1 1 1 1 1 1 1 1 1
symmnumber: 1
zpe: 625845.0 jmol-1
zpe.correction: 0.238372 hartree
zpe.thermalcorrener: 0.251196 hartree
zpe.thermalcorrenthalpy: 0.252140 hartree
zpe.thermalcorrgfe: 0.199542 hartree
zpe.sumelectzpe: -784.126350 hartree
zpe.sumelectthermal: -784.113525 hartree
zpe.sumelectthermalent: -784.112581 hartree
zpe.sumelectthermalfe: -784.165179 hartree
dipole: 0.4948 -2.5225 0.0000
dipole: 2.5705
quadrupole: -88.9397 -107.0160 -122.1449
quadrupole: -0.3258 -0.0004 -0.0002
quadrupole: 17.0939 -0.9825 -16.1113 -0.3258 -0.0004 -0.0002
hfenergy: -784.3647214 hartree
pointgroup: C01 [X(C19H11N1)]
dipole: -0.196749 -0.9920067 -0.0000041 debye
polarizability: 421.0249339|4.2427098|228.7488249|-0.0034198|0.0014586|77.9515115 unknown
InChI: InChI=1S/C19H11N/c1-2-7-15-13(4-1)10-17-19-16(15)9-8-12-5-3-6-14(11-20-17)18(12)19/h1-11H
charge 0 multiplicity 1
31 atoms
N  -0.792556 2.663823 -0.000105
C  -0.309773 0.202064 -0.000131
C  -1.718131 -0.070635 -0.000118
C  0.641744 -0.868044 -0.000152
C  2.061412 -0.553778 -0.00016
C  0.124179 1.588554 -0.000122
C  -2.203622 -1.424513 -0.000126
C  -2.64524 1.029849 -0.000097
C  2.472981 0.839423 -0.000149
C  0.130223 -2.21874 -0.000163
C  1.493648 1.8800 -0.000132
C  -1.232396 -2.488999 -0.000151
C  -2.090115 2.376122 -0.000094
C  -3.6121 -1.646961 -0.00011
C  -4.036586 0.771149 -0.000082
C  3.084442 -1.556727 -0.00018
C  3.87251 1.161006 -0.000157
C  -4.512439 -0.563513 -0.000088
C  4.440335 -1.214416 -0.000188
C  4.841503 0.157721 -0.000176
H  0.830311 -3.059156 -0.000184
H  1.801694 2.930725 -0.000125
H  -1.587285 -3.526242 -0.000159
H  -2.783011 3.229327 -0.000079
H  -3.990687 -2.675833 -0.000115
H  -4.74333 1.609488 -0.000064
H  2.810346 -2.616008 -0.000187
H  4.166094 2.217117 -0.000147
H  -5.591103 -0.753729 -0.000075
H  5.202117 -2.001843 -0.000203
H  5.906331 0.414167 -0.000183
