program: Gaussian 09
title: 000290517
version: EM64L-G09RevD.01
frameworkgroup: C1[X(C19H11N)]
method: RPBEPBE
basis: SDD
operation: Freq
keyword: #pfreq=noraman
keyword: PBEPBE/SDD
title: #p freq=noraman PBEPBE/SDD
converged: YES YES NO YES
title: Mulliken charges:
elementType: N C C C C C C C C C C C C C C C C C C C H H H H H H H H H H H
charge: -0.003386 0.144406 0.308233 0.060123 0.397746 0.192888 0.487934 0.460867 -0.039116 -0.771852 -0.430671 -0.515386 -0.586263 -0.472447 -0.356149 -0.336878 -0.454077 -0.225188 -0.254961 -0.247484 0.245108 0.225980 0.238322 0.257609 0.244577 0.227582 0.261884 0.247348 0.230057 0.230475 0.232718
chargesum: 0.00000
title: Mulliken charges with hydrogens summed into heavy atoms:
elementType: N C C C C C C C C C C C C C C C C C C C
charge: -0.003386 0.144406 0.308233 0.060123 0.397746 0.192888 0.487934 0.460867 -0.039116 -0.526744 -0.204690 -0.277063 -0.328654 -0.227870 -0.128567 -0.074994 -0.206729 0.004869 -0.024485 -0.014766
polarizability: 4.17097310e+02 9.93948836e+00 2.30865076e+02 -1.44829050e-02 -1.56392951e-02 7.79074510e+01
1716.lowfreq: -6.5484 -0.0009 -0.0007 0.0006 7.7779 14.0131 63.2708 91.7091 154.9123
frequency: 63.2596 91.7006 154.9123 189.3385 208.7040 213.8277 283.8013 309.1398 330.1623 373.6187 401.2391 459.7869 462.1486 479.0429 509.6702 512.8473 517.9197 518.0447 557.4073 558.7656 570.5437 609.6744 627.9709 689.4156 704.5305 711.9484 761.7530 767.1158 777.2316 782.2104 797.8348 843.6702 854.0336 860.7510 870.1956 881.9596 908.3019 925.6864 958.1591 969.4563 980.0094 980.5284 990.4523 994.2919 1018.1094 1037.1051 1069.0200 1103.8314 1133.0595 1163.7530 1176.9419 1178.6661 1201.4052 1229.6297 1240.5354 1262.4759 1294.9930 1317.9961 1321.1421 1368.3740 1400.3518 1403.4068 1414.0952 1422.9135 1433.0225 1442.3389 1446.7837 1466.8073 1490.2954 1518.5883 1547.1061 1574.5466 1591.4878 1604.1302 1622.8094 1625.2378 3093.9617 3119.3316 3124.3484 3126.6804 3128.7727 3134.9419 3149.0092 3151.6323 3161.6686 3168.2656 3170.8531
redmass: 5.1683 4.2102 4.9849 4.0121 5.0381 4.2847 4.9962 4.3104 7.4097 5.7134 3.6001 5.7292 3.1823 6.2829 5.4603 3.4632 3.5242 7.6662 6.5230 3.4524 3.2781 7.0320 6.7986 6.1133 4.0147 3.1385 1.3206 6.1450 1.7476 1.5521 5.9912 4.7574 1.6752 2.5371 1.6275 5.8702 1.6986 1.5695 1.5796 1.5534 1.4337 5.9830 1.3961 1.3666 4.9959 2.3371 1.9654 2.9400 1.9295 1.4231 1.2189 1.1182 1.4844 1.7651 2.1052 1.8785 1.9546 2.4729 2.6853 2.2120 3.0788 3.2901 3.1869 6.5210 2.6882 3.5810 4.2549 4.6479 3.6555 3.9858 5.8664 7.3616 6.7778 6.6936 7.4271 6.4394 1.0908 1.0913 1.0865 1.0881 1.0872 1.0888 1.0930 1.0948 1.0961 1.0975 1.0972
irintensity: 0.4916 0.5984 0.0230 0.2755 0.5922 5.6148 2.8819 0.0504 0.1652 0.2198 3.2797 2.0853 6.4272 2.2724 3.7371 0.7281 0.8939 0.2757 0.1402 1.0578 0.0324 0.3632 6.4517 0.4296 1.5289 16.3372 47.9958 1.0176 66.8219 2.2545 11.2589 1.6169 4.6670 67.1324 0.3725 0.3678 0.0020 1.2989 10.3820 24.2106 5.8763 0.0396 1.1358 1.9325 0.2848 7.9082 5.0801 3.3806 12.2376 7.6008 0.5485 3.3521 4.6399 2.2271 8.0765 5.6120 6.1645 4.1042 1.1666 0.5006 1.7451 0.4051 4.8166 2.2710 0.1690 12.7792 13.4197 0.9293 20.0409 2.3938 6.4643 3.8734 8.1144 0.3199 3.6216 3.8636 21.3053 5.9466 5.8330 1.5282 5.2079 11.4141 28.8651 11.1433 25.2125 49.1193 17.4930
temp: 298.150 k
press: 1.00000 atm
elementType: 7 6 6 6 6 6 6 6 6 6 6 6 6 6 6 6 6 6 6 6 1 1 1 1 1 1 1 1 1 1 1
symmnumber: 1
zpe: 626026.7 jmol-1
zpe.correction: 0.238441 hartree
zpe.thermalcorrener: 0.251252 hartree
zpe.thermalcorrenthalpy: 0.252196 hartree
zpe.thermalcorrgfe: 0.199620 hartree
zpe.sumelectzpe: -784.126339 hartree
zpe.sumelectthermal: -784.113528 hartree
zpe.sumelectthermalent: -784.112584 hartree
zpe.sumelectthermalfe: -784.165160 hartree
dipole: 2.0937 -2.0774 0.0001
dipole: 2.9494
quadrupole: -97.4673 -103.2073 -122.1408
quadrupole: 8.7842 -0.0019 -0.0022
quadrupole: 10.1378 4.3978 -14.5356 8.7842 -0.0019 -0.0022
hfenergy: -784.36478 hartree
pointgroup: C01 [X(C19H11N1)]
dipole: 0.8241926 0.816843 -0.0000489 debye
polarizability: 417.0860753|-10.0441801|230.8763107|0.0144741|-0.0156474|77.907451 unknown
InChI: InChI=1S/C19H11N/c1-2-6-15-13(4-1)10-14-11-20-17-7-3-5-12-8-9-16(15)18(14)19(12)17/h1-11H
charge 0 multiplicity 1
31 atoms
N  -2.213654 -2.377306 0.000095
C  -0.299159 -0.196929 -0.000044
C  0.654179 0.870704 -0.00011
C  -1.708821 0.069016 -0.000128
C  0.128113 -1.581444 0.000112
C  2.072111 0.547695 -0.000027
C  -2.192217 1.42375 -0.000283
C  2.480762 -0.847047 0.000129
C  -2.641769 -1.030188 -0.000058
C  1.496791 -1.883634 0.000197
C  0.144669 2.221245 -0.000258
C  -1.218785 2.487398 -0.000343
C  -0.90477 -2.6083 0.000172
C  -3.598927 1.655975 -0.000366
C  3.098517 1.547275 -0.000092
C  -4.029854 -0.762065 -0.000144
C  3.879493 -1.172297 0.000214
C  -4.500848 0.574476 -0.000297
C  4.453295 1.201165 -0.000006
C  4.851145 -0.171915 0.000149
H  1.825721 -2.930588 0.000321
H  0.843588 3.062587 -0.000303
H  -1.574987 3.524323 -0.000459
H  -0.591454 -3.661846 0.00029
H  -3.97205 2.686725 -0.000484
H  2.827092 2.607125 -0.000218
H  -4.718868 -1.612105 -0.000089
H  4.171704 -2.229099 0.000329
H  -5.579524 0.76483 -0.000363
H  5.217295 1.986377 -0.000056
H  5.915306 -0.430805 0.000217
