program: Gaussian 09
title: 000290509
version: EM64L-G09RevD.01
frameworkgroup: C1[X(C13H17Cl3N2O)]
method: RPBEPBE
basis: SDD
operation: Freq
keyword: #p
keyword: freq=noraman
keyword: PBEPBE/SDD
title: #p freq=noraman PBEPBE/SDD
converged: YES YES NO NO
title: Mulliken charges:
elementType: Cl Cl Cl O N N C C C C C C C C C C C C C H H H H H H H H H H H H H H H H H
charge: -0.052937 -0.051973 -0.084321 -0.296682 -0.168691 -0.388801 0.462311 -0.390786 -0.390830 -0.362735 -0.381813 0.298691 -0.585000 -0.583875 -0.394883 -0.363319 0.167486 -0.331689 -0.556516 0.250782 0.250975 0.253062 0.249658 0.235863 0.234391 0.269905 0.293559 0.268597 0.294393 0.275751 0.207656 0.310555 0.267429 0.244440 0.282225 0.267122
chargesum: 0.00000
title: Mulliken charges with hydrogens summed into heavy atoms:
elementType: Cl Cl Cl O N N C C C C C C C C C C C C C
charge: -0.052937 -0.051973 -0.084321 -0.296682 -0.168691 -0.078247 0.462311 0.110970 0.111891 -0.126871 -0.147422 0.298691 -0.021536 -0.020886 -0.119132 -0.155663 0.167486 0.180180 -0.007168
polarizability: 2.90340511e+02 8.85904794e+00 2.11190634e+02 -1.10280307e+01 1.70127983e+01 1.08832527e+02
1716.lowfreq: -0.8928 -0.0020 -0.0013 -0.0013 4.5730 6.7716 12.4023 24.9956 32.4111
frequency: 9.5365 24.8974 32.3918 40.5047 47.2419 49.4520 68.1059 79.3229 100.2118 128.6033 137.4208 138.1361 194.2783 211.5942 225.7607 243.5319 255.0894 280.3091 309.3072 341.6033 377.9355 412.4990 430.5080 464.6467 473.8049 523.9213 537.3303 575.8613 586.4204 603.0709 633.5855 673.8356 683.1096 701.6782 743.6426 754.8755 785.5405 791.8692 796.7817 809.6778 839.1649 864.7676 938.8312 953.9227 978.6990 987.9294 993.4718 999.3594 1014.1724 1035.3881 1036.4443 1042.8617 1076.5764 1120.2654 1139.9867 1144.8927 1174.5304 1184.7037 1217.0830 1222.8352 1229.0649 1256.6818 1257.1535 1274.0898 1281.7601 1295.0798 1302.3417 1322.7439 1354.2462 1357.2792 1366.3817 1373.0505 1392.3134 1434.0850 1439.6833 1444.4555 1460.2560 1460.5277 1483.0433 1487.0934 1506.9583 1524.8705 1550.5795 1593.9033 1626.5514 2992.2251 3016.8735 3022.3554 3050.7982 3062.9655 3064.2062 3065.6234 3072.9353 3078.4946 3121.9064 3147.0882 3147.8152 3149.4063 3154.0912 3160.9972 3168.5649 3560.5150
redmass: 11.4602 12.8679 12.6637 7.8144 11.6335 7.1341 3.7296 3.8029 3.1276 3.1540 4.5317 3.0556 10.2802 4.2878 6.6425 4.5584 3.6260 5.0057 4.3725 2.7145 4.9541 2.9512 3.1368 3.1666 3.1656 2.8834 4.7558 1.5023 3.7412 3.5590 6.7751 6.5388 4.0219 5.2427 3.9712 4.4340 1.1250 1.2984 2.3041 1.3874 1.6571 2.4831 1.4291 2.7549 2.4386 1.3527 2.9412 1.4267 1.7414 3.1562 2.6168 2.1743 2.7818 1.5531 1.3726 1.8337 1.5496 1.6155 1.3147 1.9041 1.2341 1.1675 1.1617 1.8145 1.3571 1.1829 1.2934 1.3603 1.2541 1.4150 1.3626 5.1756 1.8028 3.0115 1.1096 1.1694 1.0995 1.0957 1.8712 1.1081 1.1065 2.7576 6.7324 6.6644 6.2820 1.0591 1.0601 1.0607 1.0971 1.0572 1.0579 1.0619 1.1031 1.1037 1.0884 1.1087 1.0934 1.1085 1.1120 1.0934 1.0958 1.0769
irintensity: 0.0443 0.1055 1.0066 0.4795 3.4835 7.4615 1.5331 3.1168 3.3099 2.8422 5.8258 0.9456 2.6493 1.3451 4.3848 16.2717 2.4070 2.7742 2.3445 17.4430 21.0575 2.2952 2.6343 3.6077 7.2921 6.3713 30.5906 78.7065 22.0312 35.7719 5.5145 72.1094 32.5685 70.1762 7.8732 24.6736 3.3152 14.3369 9.9985 11.5160 43.7321 15.2132 2.0077 27.4175 24.9111 2.0454 1.7459 4.0137 4.3315 0.3686 0.1805 0.7410 0.6985 33.4841 20.6086 6.6434 10.7175 99.0343 125.5322 30.4671 41.4781 27.8823 15.5426 228.6013 7.2284 7.1544 146.0980 7.8765 1.8860 61.3198 10.2244 1.3136 61.8879 19.9334 7.3067 27.5849 13.9844 9.3181 515.7631 43.2653 20.2719 69.9788 38.0813 154.5161 332.1021 61.7918 22.4649 17.0710 6.2501 11.9716 17.4678 26.8341 9.8329 7.7643 21.6970 3.1426 16.2731 8.7854 16.7782 19.9443 13.1696 20.4888
temp: 298.150 k
press: 1.00000 atm
elementType: 17 17 17 8 7 7 6 6 6 6 6 6 6 6 6 6 6 6 6 1 1 1 1 1 1 1 1 1 1 1 1 1 1 1 1 1
symmnumber: 1
zpe: 743807.1 jmol-1
zpe.correction: 0.283301 hartree
zpe.thermalcorrener: 0.303680 hartree
zpe.thermalcorrenthalpy: 0.304624 hartree
zpe.thermalcorrgfe: 0.228624 hartree
zpe.sumelectzpe: -2069.068798 hartree
zpe.sumelectthermal: -2069.048419 hartree
zpe.sumelectthermalent: -2069.047475 hartree
zpe.sumelectthermalfe: -2069.123475 hartree
dipole: 0.5347 1.3432 0.3912
dipole: 1.4977
quadrupole: -135.4758 -159.0868 -132.5714
quadrupole: 3.1857 -1.6340 2.0607
quadrupole: 6.9022 -16.7088 9.8066 3.1857 -1.6340 2.0607
hfenergy: -2069.3520994 hartree
pointgroup: C01 [X(C13H17Cl3N2O1)]
dipole: 0.2571788 -0.5113543 -0.1399707 debye
polarizability: 291.0982375|-1.7195296|211.019701|11.1398175|15.5554576|108.2457332 unknown
InChI: InChI=1S/C13H17Cl3N2O/c14-5-8-17-13(19)11-1-3-12(4-2-11)18(9-6-15)10-7-16/h1-4,17H,5-10H2
charge 0 multiplicity 1
36 atoms
Cl 4.030238 -4.13702 0.067778
Cl 5.356532 3.095177 0.285603
Cl -5.78062 -2.40594 0.516158
O  -3.277054 2.130658 -0.154233
N  2.805759 -0.171226 0.054019
N  -3.75891 -0.11258 -0.523569
C  1.42168 0.077651 -0.042971
C  3.391893 -1.446536 -0.396126
C  3.732382 0.833635 0.606337
C  0.8637 1.340369 0.334346
C  0.519935 -0.920949 -0.528335
C  -1.410454 0.581146 -0.231138
C  3.29647 -2.517227 0.707763
C  4.171584 1.836724 -0.477698
C  -0.515292 1.576075 0.238774
C  -0.859568 -0.667396 -0.620096
C  -2.866172 0.931771 -0.299615
C  -5.201872 0.11689 -0.6063
C  -5.973671 -0.511082 0.553567
H  2.8973 -1.806313 -1.315397
H  4.453925 -1.286462 -0.652556
H  3.272549 1.370731 1.454044
H  4.62531 0.321123 1.005677
H  1.503685 2.149089 0.698343
H  0.887044 -1.902541 -0.841072
H  3.884135 -2.251316 1.598964
H  2.25755 -2.744469 0.985945
H  4.73077 1.352451 -1.292111
H  3.330378 2.418014 -0.881089
H  -0.935406 2.547653 0.519167
H  -1.493421 -1.465109 -1.026226
H  -3.437324 -1.081282 -0.528777
H  -5.345503 1.214318 -0.573461
H  -5.600605 -0.258572 -1.567762
H  -5.585177 -0.202102 1.53431
H  -7.056669 -0.334654 0.475441
