program: Gaussian 09
title: 000290500
version: EM64L-G09RevD.01
frameworkgroup: C1[X(C8H12N2O3S)]
method: RPBEPBE
basis: SDD
operation: Freq
keyword: #p
keyword: freq=noraman
keyword: PBEPBE/SDD
title: #p freq=noraman PBEPBE/SDD
converged: YES YES NO NO
title: Mulliken charges:
elementType: S O O O N N C C C C C C C C H H H H H H H H H H H H
charge: 0.946832 -0.314507 -0.553899 -0.568212 -0.427240 -0.658519 0.214547 -0.374151 0.220203 -0.345065 0.315210 -0.342378 -0.781158 -0.534502 0.245589 0.297663 0.227926 0.226918 0.293421 0.266103 0.258012 0.350435 0.313098 0.230524 0.254879 0.238269
chargesum: 0.00000
title: Mulliken charges with hydrogens summed into heavy atoms:
elementType: S O O O N N C C C C C C C C
charge: 0.946832 -0.314507 -0.553899 -0.568212 -0.181650 0.005014 0.214547 -0.076488 0.220203 -0.117138 0.315210 -0.115460 0.036378 0.189170
polarizability: 3.05181021e+02 1.85762434e+01 1.47004802e+02 -3.22357952e+00 1.05616325e+00 9.96370842e+01
1716.lowfreq: -5.9434 -0.0013 -0.0012 -0.0010 5.5069 9.8400 14.9036 36.7218 41.0273
frequency: 13.2243 36.6599 41.0216 89.2788 111.8701 116.5953 140.6204 170.1622 184.1743 207.8581 223.7372 243.0037 281.3633 305.9861 311.6091 358.3776 388.5517 395.7759 422.9970 456.9573 470.2593 524.1240 528.8061 535.6820 549.7876 623.1684 706.8697 729.8791 786.4200 791.7848 800.0232 851.6443 864.6209 877.5714 915.9697 926.0118 938.4994 982.8182 997.1573 1022.4760 1119.3568 1123.3083 1153.3558 1159.2110 1180.9980 1255.2916 1275.0291 1294.5529 1351.6675 1401.3343 1411.5280 1418.2273 1440.7472 1462.0631 1466.7177 1478.9260 1525.1814 1554.7715 1601.6750 1632.4150 2975.2631 3026.5659 3069.9778 3119.3424 3133.0885 3143.7493 3176.0138 3180.7576 3193.8589 3304.6074 3543.7117 3693.8646
redmass: 6.1796 4.3887 4.7774 3.7418 7.1330 4.6819 4.9541 1.2430 2.3856 2.3100 2.6318 2.8224 2.7180 6.9143 3.4951 6.4034 3.8640 4.0934 1.5472 2.5271 4.3519 3.8947 5.2887 6.4886 1.1185 3.5897 6.1627 3.2905 6.5294 1.7546 4.5116 1.6131 1.8355 1.7579 1.3874 3.5007 1.3082 1.9876 3.8620 1.6046 1.2712 1.3388 1.2689 1.3739 2.2540 2.7547 1.1468 1.4860 3.1171 3.5964 1.0582 1.0588 1.2953 3.1154 1.0490 1.1213 3.9026 6.2545 1.8948 2.2268 1.0319 1.0237 1.1048 1.0869 1.1016 1.0971 1.1069 1.1079 1.0921 1.0750 1.0450 1.1042
irintensity: 1.3631 1.1352 1.9404 5.1647 40.5218 22.3047 0.8185 4.7002 13.0007 6.0496 19.1378 1.5220 7.0520 11.1153 8.8689 16.8552 18.8580 19.3419 117.0413 8.9708 11.5134 30.0216 32.6486 16.0546 157.6460 5.6356 7.5769 7.1722 57.3425 48.9364 25.7315 54.5450 70.5719 6.1001 0.9133 13.7320 66.3562 35.3957 50.4498 0.6037 5.8773 30.3653 57.4000 5.8667 82.9997 118.2458 10.7553 6.1934 196.1279 14.6961 5.2006 10.7457 2.6872 1.9931 15.7135 49.2612 174.4225 55.3378 23.0427 545.6956 39.6860 2.4284 29.7964 8.8822 22.7649 21.2114 0.6234 2.6785 2.4374 13.6717 247.7823 43.3577
temp: 298.150 k
press: 1.00000 atm
elementType: 16 8 8 8 7 7 6 6 6 6 6 6 6 6 1 1 1 1 1 1 1 1 1 1 1 1
symmnumber: 1
zpe: 513141.5 jmol-1
zpe.correction: 0.195445 hartree
zpe.thermalcorrener: 0.211596 hartree
zpe.thermalcorrenthalpy: 0.212540 hartree
zpe.thermalcorrgfe: 0.150173 hartree
zpe.sumelectzpe: -1044.037167 hartree
zpe.sumelectthermal: -1044.021016 hartree
zpe.sumelectthermalent: -1044.020072 hartree
zpe.sumelectthermalfe: -1044.082439 hartree
dipole: -7.1822 -4.2397 2.9046
dipole: 8.8316
quadrupole: -91.7218 -77.1340 -92.8249
quadrupole: -9.9651 3.6827 -3.2853
quadrupole: -4.4949 10.0928 -5.5980 -9.9651 3.6827 -3.2853
hfenergy: -1044.232612 hartree
pointgroup: C01 [X(C8H12N2O3S1)]
dipole: -2.7357233 -1.9416252 0.904855 debye
dipolederiv: 1.0579153 -0.0209305 -0.0238437 0.4094065 1.1752081 0.0118019 0.2870816 -0.0131342 1.1472979 -0.6750228 0.4030915 0.0598141 0.757524 -1.2725904 -0.0722135 0.1534629 -0.1791963 -0.3126689 -1.2887702 -0.2171498 0.0559212 -0.2550539 -0.5304291 -0.008529 -0.0868185 0.0045636 -0.515673 -0.414513 0.1056665 0.0382685 -0.3350846 -0.7001472 -0.066161 -0.3381997 -0.1888493 -0.5424733 1.0340755 0.3244549 0.3295445 0.0976288 -0.1068346 0.0297218 0.3738291 0.075963 -0.3792608 -2.10889 -0.298562 0.0803767 -0.0941985 -0.1563709 0.0386568 0.5151899 0.1098525 -0.6811647 -0.5734248 -0.2285997 -0.2227242 -0.2376018 -0.0484687 -0.0978321 0.446556 0.0906726 -0.0020285 0.2734889 0.2975089 0.0273316 -0.1357877 -0.118168 -0.0543752 -0.0756017 -0.0224405 -0.1163139 0.0651287 -0.70828 -0.1028915 -1.361301 0.6691392 0.1455381 -0.019183 0.2829983 0.0847625 0.4846235 0.2461783 0.0217612 0.3485265 0.1033998 0.11823 -0.3461846 -0.0985744 -0.1172641 1.9763269 0.3231437 -0.2600438 0.1581693 -0.1205842 -0.0878783 -0.650294 -0.1233102 0.2121558 -0.7345279 -0.255334 -0.0881999 0.6168105 0.188209 -0.0210673 0.1864138 0.0878846 -0.1532282 -0.2574379 -0.0283038 -0.0730203 -0.1405981 -0.1844183 0.0667605 -0.3411424 0.0613587 -0.280782 0.1315328 0.1286581 0.0061708 -0.2893904 0.7577402 -0.0034494 0.0257844 -0.0537129 0.282286 0.086591 0.0047055 -0.0584604 0.1653239 -0.0225181 -0.0472065 -0.0767086 -0.0132842 0.2128156 0.1041485 -0.0654224 0.0153102 0.0094534 0.0288951 0.0083715 -0.0142065 -0.0254296 0.1266586 0.0363567 0.1112316 0.0582213 0.0550592 -0.0164622 -0.0151409 0.0270534 -0.0326977 0.1254857 0.0121003 -0.0984701 0.0348315 -0.0868474 -0.0775184 0.0159879 0.064812 0.0310871 0.1490235 0.0693142 -0.0212931 -0.0488878 0.0850964 0.0674477 0.0109711 -0.1632359 -0.0428523 -0.0190187 -0.031054 -0.040298 0.0305811 -0.0078085 0.0484741 0.0525006 -0.0097244 0.0293587 0.0459385 0.0515506 0.0627543 0.0232098 0.088765 -0.0185795 0.0036137 0.0043971 -0.0109524 0.0272076 0.3252428 0.0217533 0.0385249 -0.1714421 0.1867113 -0.0024185 0.012268 -0.0140401 0.3602535 0.2970188 0.0314612 0.0500727 0.1398352 0.1563807 -0.008762 0.0292926 -0.0139669 0.3546557 0.1090506 -0.0958957 0.0488433 0.0365722 -0.0098989 -0.0001449 0.0064816 0.0972719 -0.1277958 -0.0015409 -0.1110754 -0.1068041 0.0514543 0.0226337 0.0160261 -0.0829662 0.0193975 0.0231295 -0.0292836 0.1290065 0.0660924 0.0954887 -0.0212506 -0.0330014 0.0716431 -0.0579676 0.0960014 unknown
polarizability: 302.4240394|27.8327526|148.9919574|2.4970344|6.4937761|100.4069104 unknown
InChI: InChI=1S/C7H9N2O.CH3O2S/c1-10-7-4-5(8)2-3-6(7)9;1-4(2)3/h2-4,8H,9H2,1H3;1H3
charge 0 multiplicity 1
26 atoms
S  2.875662 0.434355 0.330604
O  -2.703879 1.334777 0.384718
O  4.37474 0.726041 -0.255167
O  1.98477 1.655957 0.971496
N  1.566418 -0.408237 -1.261119
N  -3.671597 -1.119247 0.680457
C  0.293894 -0.667839 -0.751394
C  -0.528408 0.474622 -0.462159
C  -1.819747 0.301777 0.031983
C  -0.236891 -1.979029 -0.513331
C  -2.374073 -1.014815 0.220503
C  -1.557453 -2.145701 -0.072543
C  3.101504 -0.81765 1.798883
C  -2.188534 2.708682 0.297893
H  2.089819 -1.284184 -1.481825
H  -0.092016 1.461916 -0.626483
H  0.388686 -2.858253 -0.711935
H  -1.971121 -3.151233 0.066864
H  3.600551 -0.238963 2.58882
H  2.094281 -1.140927 2.096335
H  3.728371 -1.638512 1.424113
H  -4.186535 -0.264009 0.882461
H  -4.113717 -2.022798 0.822549
H  -1.966365 2.977872 -0.751777
H  -1.276856 2.824333 0.912782
H  -2.995603 3.346465 0.68637
